{"text_format":"1","workbook":"xlsx","n_sheets":14,"sheets":["B.test","B.central","V.Test","Z.1.Test","Z.2.Test","t.1.Test","t.2.Test","t.3.Test","t.4.Test","F.Test","Chi^2.Test","Fisher.test","Yates","Yates(2)"],"not_rendered":{"charts":7,"images":2,"macros":1,"external_links":0,"defined_names":197,"comments":0,"pivot_tables":0},"unopened":[],"bounds":{"document_bytes":16777216,"sheet_cells":100000,"rows_first":2000,"rows_last":500,"rows_between":2000,"halvings":0,"cell_chars":16384,"cell_head_chars":4096},"cells_cut":0,"cells_raw":0,"read":"whole","date_system":"1900"}

{"sheet":"B.test","index":0,"n_rows":32,"n_cols":13,"rows_kept":32,"cut":false,"hidden":false,"merged":[]}
["Data","x",null,"Binomial test. Data",null,null,"Data","x","y","Sign",null,"Sign test (+): x > y. Data"]
[1,null,null,"p",0.5,null,1,18,11,{"$f":"IF(H2>I2, \"+\", \"\")","v":"+"},null,"p",0.5]
[2,"+",null,"X",{"$f":"COUNTIF(B:B,\"+\")","v":15},null,2,22,12,"+",null,"X",{"$f":"COUNTIF(J:J,\"+\")","v":10}]
[3,"+",null,"N",{"$f":"COUNT(A:A)","v":20},null,3,25,35,"",null,"N",{"$f":"COUNT(G:G)","v":15}]
[4,"+",null,"P",{"$f":"E3/E4","v":0.75},null,4,12,22,"",null,"P",{"$f":"M3/M4","v":0.66666666666666663}]
[5,"+",null,"Significance level",0.05,null,5,22,18,"+",null,"Significance level",0.05]
[6,"+",null,"Lower probability",{"$f":"IF(E3=0,0,BINOMDIST(E3,E4,E2,1))","v":0.99409103393554688},null,6,31,23,"+",null,"Lower probability",{"$f":"IF(M3=0,0,BINOMDIST(M3,M4,M2,1))","v":0.940765380859375}]
[7,"+",null,"Lower critical value",{"$f":"CRITBINOM(E4,E2,E6)","v":6},null,7,32,24,"+",null,"Lower critical value",{"$f":"CRITBINOM(M4,M2,M6)","v":4}]
[8,"+",null,"Lower significance",{"$f":"IF(E7<E6,\"S. (H1)\", \"NS (H0)\")","v":"NS (H0)"},null,8,22,22,"",null,"Lower significance",{"$f":"IF(M7<M6,\"S. (H1)\", \"NS (H0)\")","v":"NS (H0)"}]
[9,"+",null,"Upper probability",{"$f":"IF(E3=0,1,1-BINOMDIST(E3-1,E4,E2,1))","v":2.0694732666015625E-2},null,9,25,19,"+",null,"Upper probability",{"$f":"IF(M3=0,1,1-BINOMDIST(M3-1,M4,M2,1))","v":0.15087890625}]
[10,"+",null,"Upper critical value",{"$f":"CRITBINOM(E4,E2,1-E6)","v":14},null,10,18,12,"+",null,"Upper critical value",{"$f":"CRITBINOM(M4,M2,1-M6)","v":11}]
[11,"+",null,"Upper significance",{"$f":"IF(E10<E6,\"S. (H1)\", \"NS (H0)\")","v":"S. (H1)"},null,11,20,33,"",null,"Upper significance",{"$f":"IF(M10<M6,\"S. (H1)\", \"NS (H0)\")","v":"NS (H0)"}]
[12,"+",null,"Two-tailed probability",{"$f":"2*MIN(E7,E10)","v":4.138946533203125E-2},null,12,30,25,"+",null,"Two-tailed probability",{"$f":"2*MIN(M7,M10)","v":0.3017578125}]
[13,"+",null,"Two-tailed critical value",{"$f":"CRITBINOM(E4,E2,1-E6/2)","v":14},null,13,29,22,"+",null,"Two-tailed critical value",{"$f":"CRITBINOM(M4,M2,1-M6/2)","v":11}]
[14,"+",null,"Two-tailed significance",{"$f":"IF(E13<E6,\"S. (H1)\", \"NS (H0)\")","v":"S. (H1)"},null,14,27,21,"+",null,"Two-tailed significance",{"$f":"IF(M13<M6,\"S. (H1)\", \"NS (H0)\")","v":"NS (H0)"}]
[15,"+",null,null,null,null,15,25,40,""]
[16,"+",null,null,null,null,null,null,null,""]
[17,null,null,"Frequency test. Result",null,null,null,null,null,""]
[18,null,null,"p",0.1,null,null,null,null,""]
[19,null,null,"X",4,null,null,null,null,""]
[20,null,null,"N",20,null,null,null,null,""]
[null,null,null,"P",{"$f":"E20/E21","v":0.2},null,null,null,null,""]
[null,null,null,"Significance level",0.05,null,null,null,null,""]
[null,null,null,"Lower probability",{"$f":"IF(E20=0,0,BINOMDIST(E20,E21,E19,1))","v":0.95682550471553662},null,null,null,null,""]
[null,null,null,"Lower critical value",{"$f":"CRITBINOM(E21,E19,E23)","v":0},null,null,null,null,""]
[null,null,null,"Lower significance",{"$f":"IF(E24<E23,\"S. (H1)\", \"NS (H0)\")","v":"NS (H0)"},null,null,null,null,""]
[null,null,null,"Upper probability",{"$f":"IF(E20=0,1,1-BINOMDIST(E20-1,E21,E19,1))","v":0.13295332343433497},null,null,null,null,""]
[null,null,null,"Upper critical value",{"$f":"CRITBINOM(E21,E19,1-E23)","v":4},null,null,null,null,""]
[null,null,null,"Upper significance",{"$f":"IF(E27<E23,\"S. (H1)\", \"NS (H0)\")","v":"NS (H0)"},null,null,null,null,""]
[null,null,null,"Two-tailed probability",{"$f":"2*MIN(E24,E27)","v":0.26590664686866994},null,null,null,null,""]
[null,null,null,"Two-tailed critical value",{"$f":"CRITBINOM(E21,E19,1-E23/2)","v":5},null,null,null,null,""]
[null,null,null,"Two-tailed significance",{"$f":"IF(E30<E23,\"S. (H1)\", \"NS (H0)\")","v":"NS (H0)"}]

{"sheet":"B.central","index":1,"n_rows":113,"n_cols":40,"rows_kept":113,"cut":false,"hidden":false,"merged":[]}
["n","p","q","max",null,null,null,null,null,null,null,null,null,null,null,null,null,null,null,null,null,null,null,null,null,"x","n","p","Bin","Lower p.","Upper p."]
[10,0.5,{"$f":"1-B2","v":0.5},{"$f":"A2*B2-C2","v":4.5},null,null,null,null,null,null,null,null,null,null,null,null,null,null,null,null,null,null,null,null,null,0,3,0.5,{"$f":"bint(Z2,AA2,AB2,0)","v":0.12500000000000003},{"$f":"bint(Z2,AA2,AB2,1)","v":0.12500000000000003},{"$f":"bint(Z2,AA2,AB2,2)","v":1}]
[50,0.5,0.5,24.5,null,null,null,null,null,null,null,null,null,null,null,null,null,null,null,null,null,null,null,null,null,1,3,0.5,{"$f":"bint(Z3,AA3,AB3,0)","v":0.375},{"$f":"bint(Z3,AA3,AB3,1)","v":0.5},{"$f":"bint(Z3,AA3,AB3,2)","v":0.875}]
[100,0.5,0.5,49.5,null,null,null,null,null,null,null,null,null,null,null,null,null,null,null,null,null,null,null,null,null,2,3,0.5,{"$f":"bint(Z4,AA4,AB4,0)","v":0.375},{"$f":"bint(Z4,AA4,AB4,1)","v":0.875},{"$f":"bint(Z4,AA4,AB4,2)","v":0.5}]
[100,0.2,0.8,19.2,null,null,null,null,null,null,null,null,null,null,null,null,null,null,null,null,null,null,null,null,null,3,3,0.5,{"$f":"bint(Z5,AA5,AB5,0)","v":0.12500000000000003},{"$f":"bint(Z5,AA5,AB5,1)","v":1},{"$f":"bint(Z5,AA5,AB5,2)","v":0.12500000000000003}]
[100,0.8,0.19999999999999996,79.8]
[100,0.7,0.30000000000000004,69.7,null,null,null,null,null,null,null,null,null,null,null,null,null,null,null,null,null,null,null,null,null,"x","n","p","Bin","Lower p.","Upper p."]
[100,0.01,0.99,1.0000000000000009E-2,null,null,null,null,null,null,null,null,null,null,null,null,null,null,null,null,null,null,null,null,null,0,2,0.5,{"$f":"bint(Z8,AA8,AB8,0)","v":0.25},{"$f":"bint(Z8,AA8,AB8,1)","v":0.25},{"$f":"bint(Z8,AA8,AB8,2)","v":1}]
[100,0.1,0.9,9.1,null,null,null,null,null,null,null,null,null,null,null,null,null,null,null,null,null,null,null,null,null,1,2,0.5,{"$f":"bint(Z9,AA9,AB9,0)","v":0.5},{"$f":"bint(Z9,AA9,AB9,1)","v":0.75},{"$f":"bint(Z9,AA9,AB9,2)","v":0.75}]
[95,0.05,0.95,3.8,null,null,null,null,null,null,null,null,{"$f":"bint(6,10,0.5,3)","v":0.656250000000002}]
[null,null,null,null,null,null,null,null,null,null,null,null,null,null,null,null,null,null,null,null,null,null,null,null,null,null,null,null,null,null,null,null,null,null,null,null,null,"L","U"]
["x","n","p","Bin","Lower p.","Upper p.","Central.p","Central.U",null,"x","n","p","Bin","Lower p.","Upper p.",null,null,"x","n","p","Bin","Lower p.","Upper p.","Central p",null,"x","n","p","Bin","Lower p.","Upper p.","Central.p",null,"c","n","p","Bin","Lower p.","Upper p.","Central p"]
[0,10,0.5,{"$f":"bint(A13,B13,C13,0)","v":9.765625E-4},{"$f":"bint(A13,B13,C13,1)","v":9.765625E-4},{"$f":"bint(A13,B13,C13,2)","v":1.0000000000000029},{"$f":"bint(A13,B13,C13,3)","v":1.0000000000000029},{"$f":"binU(A13,B13,C13,3)","v":1},null,0,20,0.5,{"$f":"bint(J13,K13,L13,0)","v":9.5367431640625E-7},{"$f":"bint(J13,K13,L13,1)","v":9.5367431640625E-7},{"$f":"bint(J13,K13,L13,2)","v":0.999999999999998},null,null,0,50,0.5,{"$f":"bint(R13,S13,T13,0)","v":8.8817841970012444E-16},{"$f":"bint(R13,S13,T13,1)","v":8.8817841970012444E-16},{"$f":"bint(R13,S13,T13,2)","v":1.0000000000000102},{"$f":"bint(R13,S13,T13,3)","v":1.0000000000000102},null,0,100,0.5,{"$f":"bint(Z13,AA13,AB13,0)","v":7.8886090522101049E-31},{"$f":"bint(Z13,AA13,AB13,1)","v":7.8886090522101049E-31},{"$f":"bint(Z13,AA13,AB13,2)","v":1.0000000000000686},{"$f":"bint(Z13,AA13,AB13,3)","v":1.0000000000000686},null,0,100,0.2,{"$f":"bint(AH13,AI13,AJ13,0)","v":2.0370359763344954E-10},{"$f":"bint(AH13,AI13,AJ13,1)","v":2.0370359763344954E-10},{"$f":"bint(AH13,AI13,AJ13,2)","v":1.0000000000000637},{"$f":"bint(AH13,AI13,AJ13,3)","v":1.0000000000000637}]
[1,10,0.5,{"$f":"bint(A14,B14,C14,0)","v":9.7656250000000104E-3},{"$f":"bint(A14,B14,C14,1)","v":1.074218750000001E-2},{"$f":"bint(A14,B14,C14,2)","v":0.99902343750000289},{"$f":"bint(A14,B14,C14,3)","v":0.99804687500000289},{"$f":"binU(A14,B14,C14,3)","v":0.99804687500000289},null,1,20,0.5,{"$f":"bint(J14,K14,L14,0)","v":1.907348632812499E-5},{"$f":"bint(J14,K14,L14,1)","v":2.002716064453124E-5},{"$f":"bint(J14,K14,L14,2)","v":0.9999990463256816},null,null,1,50,0.5,{"$f":"bint(R14,S14,T14,0)","v":4.4408920985006558E-14},{"$f":"bint(R14,S14,T14,1)","v":4.5297099404706683E-14},{"$f":"bint(R14,S14,T14,2)","v":1.0000000000000093},{"$f":"bint(R14,S14,T14,3)","v":1.0000000000000093},null,1,100,0.5,{"$f":"bint(Z14,AA14,AB14,0)","v":7.8886090522099544E-29},{"$f":"bint(Z14,AA14,AB14,1)","v":7.9674951427320556E-29},{"$f":"bint(Z14,AA14,AB14,2)","v":1.0000000000000686},{"$f":"bint(Z14,AA14,AB14,3)","v":1.0000000000000686},null,1,100,0.2,{"$f":"bint(AH14,AI14,AJ14,0)","v":5.0925899408361405E-9},{"$f":"bint(AH14,AI14,AJ14,1)","v":5.2962935384695903E-9},{"$f":"bint(AH14,AI14,AJ14,2)","v":0.99999999979636012},{"$f":"bint(AH14,AI14,AJ14,3)","v":0.99999999979636012}]
[2,10,0.5,{"$f":"bint(A15,B15,C15,0)","v":4.3945312500000069E-2},{"$f":"bint(A15,B15,C15,1)","v":5.4687500000000083E-2},{"$f":"bint(A15,B15,C15,2)","v":0.98925781250000289},{"$f":"bint(A15,B15,C15,3)","v":0.97851562500000289},{"$f":"binU(A15,B15,C15,3)","v":0.97851562500000289},null,2,20,0.5,{"$f":"bint(J15,K15,L15,0)","v":1.8119812011718734E-4},{"$f":"bint(J15,K15,L15,1)","v":2.0122528076171859E-4},{"$f":"bint(J15,K15,L15,2)","v":0.99997997283935347},null,null,2,50,0.5,{"$f":"bint(R15,S15,T15,0)","v":1.0880185641326512E-12},{"$f":"bint(R15,S15,T15,1)","v":1.1333156635373578E-12},{"$f":"bint(R15,S15,T15,2)","v":0.99999999999996503},{"$f":"bint(R15,S15,T15,3)","v":0.99999999999996503},null,2,100,0.5,{"$f":"bint(Z15,AA15,AB15,0)","v":3.9048614808439927E-27},{"$f":"bint(Z15,AA15,AB15,1)","v":3.9845364322713134E-27},{"$f":"bint(Z15,AA15,AB15,2)","v":1.0000000000000686},{"$f":"bint(Z15,AA15,AB15,3)","v":1.0000000000000686},null,2,100,0.2,{"$f":"bint(AH15,AI15,AJ15,0)","v":6.3020800517848503E-8},{"$f":"bint(AH15,AI15,AJ15,1)","v":6.8317094056318095E-8},{"$f":"bint(AH15,AI15,AJ15,2)","v":0.99999999470377021},{"$f":"bint(AH15,AI15,AJ15,3)","v":0.99999999470377021}]
[3,10,0.5,{"$f":"bint(A16,B16,C16,0)","v":0.11718750000000035},{"$f":"bint(A16,B16,C16,1)","v":0.17187500000000044},{"$f":"bint(A16,B16,C16,2)","v":0.94531250000000278},{"$f":"bint(A16,B16,C16,3)","v":0.89062500000000266},{"$f":"binU(A16,B16,C16,3)","v":0.89062500000000266},null,3,20,0.5,{"$f":"bint(J16,K16,L16,0)","v":1.0871887207031235E-3},{"$f":"bint(J16,K16,L16,1)","v":1.288414001464842E-3},{"$f":"bint(J16,K16,L16,2)","v":0.99979877471923628},null,null,3,50,0.5,{"$f":"bint(R16,S16,T16,0)","v":1.7408297026122487E-11},{"$f":"bint(R16,S16,T16,1)","v":1.8541612689659843E-11},{"$f":"bint(R16,S16,T16,2)","v":0.99999999999887701},{"$f":"bint(R16,S16,T16,3)","v":0.99999999999887701},null,3,100,0.5,{"$f":"bint(Z16,AA16,AB16,0)","v":1.2755880837424082E-25},{"$f":"bint(Z16,AA16,AB16,1)","v":1.3154334480651213E-25},{"$f":"bint(Z16,AA16,AB16,2)","v":1.0000000000000686},{"$f":"bint(Z16,AA16,AB16,3)","v":1.0000000000000686},null,3,100,0.2,{"$f":"bint(AH16,AI16,AJ16,0)","v":5.1466987089577323E-7},{"$f":"bint(AH16,AI16,AJ16,1)","v":5.829869649520913E-7},{"$f":"bint(AH16,AI16,AJ16,2)","v":0.99999993168296963},{"$f":"bint(AH16,AI16,AJ16,3)","v":0.99999948690209428}]
[4,10,0.5,{"$f":"bint(A17,B17,C17,0)","v":0.20507812500000058},{"$f":"bint(A17,B17,C17,1)","v":0.376953125000001},{"$f":"bint(A17,B17,C17,2)","v":0.82812500000000244},{"$f":"bint(A17,B17,C17,3)","v":0.656250000000002},{"$f":"binU(A17,B17,C17,3)","v":0.656250000000002},null,4,20,0.5,{"$f":"bint(J17,K17,L17,0)","v":4.6205520629882544E-3},{"$f":"bint(J17,K17,L17,1)","v":5.9089660644530964E-3},{"$f":"bint(J17,K17,L17,2)","v":0.99871158599853316},null,null,4,50,0.5,{"$f":"bint(R17,S17,T17,0)","v":2.0454749005693933E-10},{"$f":"bint(R17,S17,T17,1)","v":2.2308910274659917E-10},{"$f":"bint(R17,S17,T17,2)","v":0.99999999998146871},{"$f":"bint(R17,S17,T17,3)","v":0.99999999998146871},null,4,100,0.5,{"$f":"bint(Z17,AA17,AB17,0)","v":3.0933011030753505E-24},{"$f":"bint(Z17,AA17,AB17,1)","v":3.2248444478818628E-24},{"$f":"bint(Z17,AA17,AB17,2)","v":1.0000000000000686},{"$f":"bint(Z17,AA17,AB17,3)","v":1.0000000000000686},null,4,100,0.2,{"$f":"bint(AH17,AI17,AJ17,0)","v":3.1201860923056296E-6},{"$f":"bint(AH17,AI17,AJ17,1)","v":3.7031730572577207E-6},{"$f":"bint(AH17,AI17,AJ17,2)","v":0.99999941701309869},{"$f":"bint(AH17,AI17,AJ17,3)","v":0.9999958085929842}]
[5,10,0.5,{"$f":"bint(A18,B18,C18,0)","v":0.24609375000000089},{"$f":"bint(A18,B18,C18,1)","v":0.62304687500000189},{"$f":"bint(A18,B18,C18,2)","v":0.62304687500000189},{"$f":"bint(A18,B18,C18,3)","v":0.24609375000000089},{"$f":"binU(A18,B18,C18,3)","v":0.24609375000000089},null,5,20,0.5,{"$f":"bint(J18,K18,L18,0)","v":1.4785766601562483E-2},{"$f":"bint(J18,K18,L18,1)","v":2.069473266601558E-2},{"$f":"bint(J18,K18,L18,2)","v":0.99409103393554499},null,null,5,50,0.5,{"$f":"bint(R18,S18,T18,0)","v":1.8818369085238804E-9},{"$f":"bint(R18,S18,T18,1)","v":2.1049260112704794E-9},{"$f":"bint(R18,S18,T18,2)","v":0.99999999977692122},{"$f":"bint(R18,S18,T18,3)","v":0.99999999977692122},null,5,100,0.5,{"$f":"bint(Z18,AA18,AB18,0)","v":5.9391381179047828E-23},{"$f":"bint(Z18,AA18,AB18,1)","v":6.2616225626929693E-23},{"$f":"bint(Z18,AA18,AB18,2)","v":1.0000000000000686},{"$f":"bint(Z18,AA18,AB18,3)","v":1.0000000000000686},null,5,100,0.2,{"$f":"bint(AH18,AI18,AJ18,0)","v":1.4976893243067295E-5},{"$f":"bint(AH18,AI18,AJ18,1)","v":1.8680066300325016E-5},{"$f":"bint(AH18,AI18,AJ18,2)","v":0.99999629682700653},{"$f":"bint(AH18,AI18,AJ18,3)","v":0.99998661303411429}]
[6,10,0.5,{"$f":"bint(A19,B19,C19,0)","v":0.20507812500000058},{"$f":"bint(A19,B19,C19,1)","v":0.82812500000000244},{"$f":"bint(A19,B19,C19,2)","v":0.376953125000001},{"$f":"bint(A19,B19,C19,3)","v":0.656250000000002},{"$f":"binU(A19,B19,C19,3)","v":0.656250000000002},null,6,20,0.5,{"$f":"bint(J19,K19,L19,0)","v":3.6964416503906271E-2},{"$f":"bint(J19,K19,L19,1)","v":5.7659149169921847E-2},{"$f":"bint(J19,K19,L19,2)","v":0.9793052673339826},null,null,6,50,0.5,{"$f":"bint(R19,S19,T19,0)","v":1.4113776813929081E-8},{"$f":"bint(R19,S19,T19,1)","v":1.621870282519956E-8},{"$f":"bint(R19,S19,T19,2)","v":0.99999999789508431},{"$f":"bint(R19,S19,T19,3)","v":0.99999999789508431},null,6,100,0.5,{"$f":"bint(Z19,AA19,AB19,0)","v":9.4036353533494172E-22},{"$f":"bint(Z19,AA19,AB19,1)","v":1.0029797609618713E-21},{"$f":"bint(Z19,AA19,AB19,2)","v":1.0000000000000686},{"$f":"bint(Z19,AA19,AB19,3)","v":1.0000000000000686},null,6,100,0.2,{"$f":"bint(AH19,AI19,AJ19,0)","v":5.9283535753809583E-5},{"$f":"bint(AH19,AI19,AJ19,1)","v":7.79636020541346E-5},{"$f":"bint(AH19,AI19,AJ19,2)","v":0.99998131993376338},{"$f":"bint(AH19,AI19,AJ19,3)","v":0.99991946819336297}]
[7,10,0.5,{"$f":"bint(A20,B20,C20,0)","v":0.11718750000000035},{"$f":"bint(A20,B20,C20,1)","v":0.94531250000000278},{"$f":"bint(A20,B20,C20,2)","v":0.17187500000000042},{"$f":"bint(A20,B20,C20,3)","v":0.89062500000000266},{"$f":"binU(A20,B20,C20,3)","v":0.89062500000000266},null,7,20,0.5,{"$f":"bint(J20,K20,L20,0)","v":7.3928833007812417E-2},{"$f":"bint(J20,K20,L20,1)","v":0.13158798217773426},{"$f":"bint(J20,K20,L20,2)","v":0.94234085083007624},null,null,7,50,0.5,{"$f":"bint(R20,S20,T20,0)","v":8.8715168544696459E-8},{"$f":"bint(R20,S20,T20,1)","v":1.0493387136989602E-7},{"$f":"bint(R20,S20,T20,2)","v":0.9999999837813075},{"$f":"bint(R20,S20,T20,3)","v":0.9999999837813075},null,7,100,0.5,{"$f":"bint(Z20,AA20,AB20,0)","v":1.2627738903068464E-20},{"$f":"bint(Z20,AA20,AB20,1)","v":1.3630718664030335E-20},{"$f":"bint(Z20,AA20,AB20,2)","v":1.0000000000000686},{"$f":"bint(Z20,AA20,AB20,3)","v":1.0000000000000686},null,7,100,0.2,{"$f":"bint(AH20,AI20,AJ20,0)","v":1.9902329860206345E-4},{"$f":"bint(AH20,AI20,AJ20,1)","v":2.7698690065619807E-4},{"$f":"bint(AH20,AI20,AJ20,2)","v":0.99992203639800958},{"$f":"bint(AH20,AI20,AJ20,3)","v":0.99958594923637356}]
[8,10,0.5,{"$f":"bint(A21,B21,C21,0)","v":4.3945312500000069E-2},{"$f":"bint(A21,B21,C21,1)","v":0.98925781250000289},{"$f":"bint(A21,B21,C21,2)","v":5.4687500000000083E-2},{"$f":"bint(A21,B21,C21,3)","v":0.97851562500000289},{"$f":"binU(A21,B21,C21,3)","v":0.97851562500000289},null,8,20,0.5,{"$f":"bint(J21,K21,L21,0)","v":0.12013435363769531},{"$f":"bint(J21,K21,L21,1)","v":0.25172233581542958},{"$f":"bint(J21,K21,L21,2)","v":0.86841201782226385},null,null,8,50,0.5,{"$f":"bint(R21,S21,T21,0)","v":4.7684403092774225E-7},{"$f":"bint(R21,S21,T21,1)","v":5.8177790229763824E-7},{"$f":"bint(R21,S21,T21,2)","v":0.99999989506613896},{"$f":"bint(R21,S21,T21,3)","v":0.99999979013226759},null,8,100,0.5,{"$f":"bint(Z21,AA21,AB21,0)","v":1.4679746474818056E-19},{"$f":"bint(Z21,AA21,AB21,1)","v":1.6042818341221089E-19},{"$f":"bint(Z21,AA21,AB21,2)","v":1.0000000000000686},{"$f":"bint(Z21,AA21,AB21,3)","v":1.0000000000000686},null,8,100,0.2,{"$f":"bint(AH21,AI21,AJ21,0)","v":5.7841146156228495E-4},{"$f":"bint(AH21,AI21,AJ21,1)","v":8.5539836221848302E-4},{"$f":"bint(AH21,AI21,AJ21,2)","v":0.99972301309940759},{"$f":"bint(AH21,AI21,AJ21,3)","v":0.99898612949786214}]
[9,10,0.5,{"$f":"bint(A22,B22,C22,0)","v":9.7656250000000104E-3},{"$f":"bint(A22,B22,C22,1)","v":0.99902343750000289},{"$f":"bint(A22,B22,C22,2)","v":1.074218750000001E-2},{"$f":"bint(A22,B22,C22,3)","v":0.99804687500000289},{"$f":"binU(A22,B22,C22,3)","v":0.99804687500000289},null,9,20,0.5,{"$f":"bint(J22,K22,L22,0)","v":0.16017913818359344},{"$f":"bint(J22,K22,L22,1)","v":0.41190147399902299},{"$f":"bint(J22,K22,L22,2)","v":0.74827766418456854},null,null,9,50,0.5,{"$f":"bint(R22,S22,T22,0)","v":2.2252721443294698E-6},{"$f":"bint(R22,S22,T22,1)","v":2.8070500466271081E-6},{"$f":"bint(R22,S22,T22,2)","v":0.99999941822210803},{"$f":"bint(R22,S22,T22,3)","v":0.99999883644420573},null,9,100,0.5,{"$f":"bint(Z22,AA22,AB22,0)","v":1.5005963063147578E-18},{"$f":"bint(Z22,AA22,AB22,1)","v":1.6610244897269688E-18},{"$f":"bint(Z22,AA22,AB22,2)","v":1.0000000000000686},{"$f":"bint(Z22,AA22,AB22,3)","v":1.0000000000000686},null,9,100,0.2,{"$f":"bint(AH22,AI22,AJ22,0)","v":1.4781626239925285E-3},{"$f":"bint(AH22,AI22,AJ22,1)","v":2.3335609862110114E-3},{"$f":"bint(AH22,AI22,AJ22,2)","v":0.99914460163784524},{"$f":"bint(AH22,AI22,AJ22,3)","v":0.99759416108364785}]
[10,10,0.5,{"$f":"bint(A23,B23,C23,0)","v":9.765625E-4},{"$f":"bint(A23,B23,C23,1)","v":1.0000000000000029},{"$f":"bint(A23,B23,C23,2)","v":9.765625E-4},{"$f":"bint(A23,B23,C23,3)","v":1.0000000000000029},{"$f":"binU(A23,B23,C23,3)","v":1},null,10,20,0.5,{"$f":"bint(J23,K23,L23,0)","v":0.17619705200195229},{"$f":"bint(J23,K23,L23,1)","v":0.58809852600097523},{"$f":"bint(J23,K23,L23,2)","v":0.58809852600097512},null,null,10,50,0.5,{"$f":"bint(R23,S23,T23,0)","v":9.1236157917508265E-6},{"$f":"bint(R23,S23,T23,1)","v":1.1930665838377934E-5},{"$f":"bint(R23,S23,T23,2)","v":0.9999971929499637},{"$f":"bint(R23,S23,T23,3)","v":0.99999438589991707},null,10,100,0.5,{"$f":"bint(Z23,AA23,AB23,0)","v":1.3655426387463671E-17},{"$f":"bint(Z23,AA23,AB23,1)","v":1.5316450877190641E-17},{"$f":"bint(Z23,AA23,AB23,2)","v":1.0000000000000686},{"$f":"bint(Z23,AA23,AB23,3)","v":1.0000000000000686},null,10,100,0.2,{"$f":"bint(AH23,AI23,AJ23,0)","v":3.3628199695828536E-3},{"$f":"bint(AH23,AI23,AJ23,1)","v":5.6963809557938651E-3},{"$f":"bint(AH23,AI23,AJ23,2)","v":0.99766643901385266},{"$f":"bint(AH23,AI23,AJ23,3)","v":0.99160710353280934}]
[null,null,null,null,null,null,null,null,null,11,20,0.5,{"$f":"bint(J24,K24,L24,0)","v":0.16017913818359344},{"$f":"bint(J24,K24,L24,1)","v":0.74827766418456865},{"$f":"bint(J24,K24,L24,2)","v":0.41190147399902283},null,null,11,50,0.5,{"$f":"bint(R24,S24,T24,0)","v":3.3176784697275828E-5},{"$f":"bint(R24,S24,T24,1)","v":4.5107450535653761E-5},{"$f":"bint(R24,S24,T24,2)","v":0.99998806933417195},{"$f":"bint(R24,S24,T24,3)","v":0.99997613866833357},null,11,100,0.5,{"$f":"bint(Z24,AA24,AB24,0)","v":1.11726215897433E-16},{"$f":"bint(Z24,AA24,AB24,1)","v":1.2704266677462364E-16},{"$f":"bint(Z24,AA24,AB24,2)","v":1.0000000000000686},{"$f":"bint(Z24,AA24,AB24,3)","v":1.0000000000000686},null,11,100,0.2,{"$f":"bint(AH24,AI24,AJ24,0)","v":6.8784953923286965E-3},{"$f":"bint(AH24,AI24,AJ24,1)","v":1.2574876348122561E-2},{"$f":"bint(AH24,AI24,AJ24,2)","v":0.99430361904426989},{"$f":"bint(AH24,AI24,AJ24,3)","v":0.98305464032327761}]
["x","n","p","Bin","Lower p.","Upper p.","Central.p","Central.U",null,12,20,0.5,{"$f":"bint(J25,K25,L25,0)","v":0.1201343536376951},{"$f":"bint(J25,K25,L25,1)","v":0.86841201782226374},{"$f":"bint(J25,K25,L25,2)","v":0.2517223358154293},null,null,12,50,0.5,{"$f":"bint(R25,S25,T25,0)","v":1.0782455026614637E-4},{"$f":"bint(R25,S25,T25,1)","v":1.5293200080180013E-4},{"$f":"bint(R25,S25,T25,2)","v":0.99995489254947467},{"$f":"bint(R25,S25,T25,3)","v":0.99990978509893902},null,12,100,0.5,{"$f":"bint(Z25,AA25,AB25,0)","v":8.2863610123929486E-16},{"$f":"bint(Z25,AA25,AB25,1)","v":9.5567876801391843E-16},{"$f":"bint(Z25,AA25,AB25,2)","v":1.0000000000000684},{"$f":"bint(Z25,AA25,AB25,3)","v":1.0000000000000684},null,12,100,0.2,{"$f":"bint(AH25,AI25,AJ25,0)","v":1.2753876873276216E-2},{"$f":"bint(AH25,AI25,AJ25,1)","v":2.5328753221398777E-2},{"$f":"bint(AH25,AI25,AJ25,2)","v":0.98742512365194124},{"$f":"bint(AH25,AI25,AJ25,3)","v":0.96740491691976715}]
[0,40,0.5,{"$f":"bint(A26,B26,C26,0)","v":9.0949470177292824E-13},{"$f":"bint(A26,B26,C26,1)","v":9.0949470177292824E-13},{"$f":"bint(A26,B26,C26,2)","v":1.0000000000000049},{"$f":"bint(A26,B26,C26,3)","v":1.0000000000000049},{"$f":"binU(A26,B26,C26,3)","v":1},null,13,20,0.5,{"$f":"bint(J26,K26,L26,0)","v":7.3928833007812417E-2},{"$f":"bint(J26,K26,L26,1)","v":0.94234085083007613},{"$f":"bint(J26,K26,L26,2)","v":0.13158798217773424},null,null,13,50,0.5,{"$f":"bint(R26,S26,T26,0)","v":3.1517945462411354E-4},{"$f":"bint(R26,S26,T26,1)","v":4.6811145542591367E-4},{"$f":"bint(R26,S26,T26,2)","v":0.99984706799920853},{"$f":"bint(R26,S26,T26,3)","v":0.99969413599840673},null,13,100,0.5,{"$f":"bint(Z26,AA26,AB26,0)","v":5.6092289930045022E-15},{"$f":"bint(Z26,AA26,AB26,1)","v":6.5649077610184202E-15},{"$f":"bint(Z26,AA26,AB26,2)","v":1.0000000000000675},{"$f":"bint(Z26,AA26,AB26,3)","v":1.0000000000000675},null,13,100,0.2,{"$f":"bint(AH26,AI26,AJ26,0)","v":2.1583483939390687E-2},{"$f":"bint(AH26,AI26,AJ26,1)","v":4.6912237160789461E-2},{"$f":"bint(AH26,AI26,AJ26,2)","v":0.97467124677866501},{"$f":"bint(AH26,AI26,AJ26,3)","v":0.94051961713958709}]
[1,40,0.5,{"$f":"bint(A27,B27,C27,0)","v":3.6379788070917046E-11},{"$f":"bint(A27,B27,C27,1)","v":3.7289282772689974E-11},{"$f":"bint(A27,B27,C27,2)","v":0.99999999999909528},{"$f":"bint(A27,B27,C27,3)","v":0.99999999999909528},{"$f":"binU(A27,B27,C27,3)","v":0.99999999999818578},null,14,20,0.5,{"$f":"bint(J27,K27,L27,0)","v":3.6964416503906208E-2},{"$f":"bint(J27,K27,L27,1)","v":0.97930526733398238},{"$f":"bint(J27,K27,L27,2)","v":5.7659149169921806E-2},null,null,14,50,0.5,{"$f":"bint(R27,S27,T27,0)","v":8.3297427293516101E-4},{"$f":"bint(R27,S27,T27,1)","v":1.3010857283610746E-3},{"$f":"bint(R27,S27,T27,2)","v":0.99953188854458441},{"$f":"bint(R27,S27,T27,3)","v":0.9990637770891585},null,14,100,0.5,{"$f":"bint(Z27,AA27,AB27,0)","v":3.485735159938542E-14},{"$f":"bint(Z27,AA27,AB27,1)","v":4.1422259360403839E-14},{"$f":"bint(Z27,AA27,AB27,2)","v":1.000000000000062},{"$f":"bint(Z27,AA27,AB27,3)","v":1.000000000000062},null,14,100,0.2,{"$f":"bint(AH27,AI27,AJ27,0)","v":3.3531483977267601E-2},{"$f":"bint(AH27,AI27,AJ27,1)","v":8.0443721138057062E-2},{"$f":"bint(AH27,AI27,AJ27,2)","v":0.95308776283927432},{"$f":"bint(AH27,AI27,AJ27,3)","v":0.8656123781956937}]
[2,40,0.5,{"$f":"bint(A28,B28,C28,0)","v":7.0940586738288165E-10},{"$f":"bint(A28,B28,C28,1)","v":7.466951501555716E-10},{"$f":"bint(A28,B28,C28,2)","v":0.99999999996271549},{"$f":"bint(A28,B28,C28,3)","v":0.99999999996271549},{"$f":"binU(A28,B28,C28,3)","v":0.99999999992542621},null,15,20,0.5,{"$f":"bint(J28,K28,L28,0)","v":1.4785766601562483E-2},{"$f":"bint(J28,K28,L28,1)","v":0.99409103393554488},{"$f":"bint(J28,K28,L28,2)","v":2.0694732666015597E-2},null,null,15,50,0.5,{"$f":"bint(R28,S28,T28,0)","v":1.9991382550443837E-3},{"$f":"bint(R28,S28,T28,1)","v":3.3002239834054583E-3},{"$f":"bint(R28,S28,T28,2)","v":0.99869891427164925},{"$f":"bint(R28,S28,T28,3)","v":0.99739782854328818},null,15,100,0.5,{"$f":"bint(Z28,AA28,AB28,0)","v":1.9984881583647803E-13},{"$f":"bint(Z28,AA28,AB28,1)","v":2.4127107519688187E-13},{"$f":"bint(Z28,AA28,AB28,2)","v":1.0000000000000271},{"$f":"bint(Z28,AA28,AB28,3)","v":1.0000000000000271},null,15,100,0.2,{"$f":"bint(AH28,AI28,AJ28,0)","v":4.8061793700750775E-2},{"$f":"bint(AH28,AI28,AJ28,1)","v":0.12850551483880784},{"$f":"bint(AH28,AI28,AJ28,2)","v":0.91955627886200675},{"$f":"bint(AH28,AI28,AJ28,3)","v":0.78820306152900632}]
[3,40,0.5,{"$f":"bint(A29,B29,C29,0)","v":8.9858076535165211E-9},{"$f":"bint(A29,B29,C29,1)","v":9.7325028036720918E-9},{"$f":"bint(A29,B29,C29,2)","v":0.99999999925330962},{"$f":"bint(A29,B29,C29,3)","v":0.99999999925330962},{"$f":"binU(A29,B29,C29,3)","v":0.99999999850661447},null,16,20,0.5,{"$f":"bint(J29,K29,L29,0)","v":4.6205520629882708E-3},{"$f":"bint(J29,K29,L29,1)","v":0.99871158599853316},{"$f":"bint(J29,K29,L29,2)","v":5.9089660644531129E-3},null,null,16,50,0.5,{"$f":"bint(R29,S29,T29,0)","v":4.3731149329095925E-3},{"$f":"bint(R29,S29,T29,1)","v":7.6733389163150508E-3},{"$f":"bint(R29,S29,T29,2)","v":0.99669977601660487},{"$f":"bint(R29,S29,T29,3)","v":0.99339955203319941},null,16,100,0.5,{"$f":"bint(Z29,AA29,AB29,0)","v":1.0616968341312647E-12},{"$f":"bint(Z29,AA29,AB29,1)","v":1.3029679093281465E-12},{"$f":"bint(Z29,AA29,AB29,2)","v":0.99999999999982714},{"$f":"bint(Z29,AA29,AB29,3)","v":0.99999999999982714},null,16,100,0.2,{"$f":"bint(AH29,AI29,AJ29,0)","v":6.3832069758808591E-2},{"$f":"bint(AH29,AI29,AJ29,1)","v":0.19233758459761643},{"$f":"bint(AH29,AI29,AJ29,2)","v":0.87149448516125594},{"$f":"bint(AH29,AI29,AJ29,3)","v":0.68240727744744178}]
[4,40,0.5,{"$f":"bint(A30,B30,C30,0)","v":8.3118720795027316E-8},{"$f":"bint(A30,B30,C30,1)","v":9.2851223598699408E-8},{"$f":"bint(A30,B30,C30,2)","v":0.99999999026750197},{"$f":"bint(A30,B30,C30,3)","v":0.99999999026750197},{"$f":"binU(A30,B30,C30,3)","v":0.99999998053499917},null,17,20,0.5,{"$f":"bint(J30,K30,L30,0)","v":1.0871887207031235E-3},{"$f":"bint(J30,K30,L30,1)","v":0.99979877471923628},{"$f":"bint(J30,K30,L30,2)","v":1.2884140014648424E-3},null,null,17,50,0.5,{"$f":"bint(R30,S30,T30,0)","v":8.7462298658192335E-3},{"$f":"bint(R30,S30,T30,1)","v":1.6419568782134283E-2},{"$f":"bint(R30,S30,T30,2)","v":0.99232666108369527},{"$f":"bint(R30,S30,T30,3)","v":0.98465332216738022},null,17,100,0.5,{"$f":"bint(Z30,AA30,AB30,0)","v":5.2460314157073355E-12},{"$f":"bint(Z30,AA30,AB30,1)","v":6.5489993250354824E-12},{"$f":"bint(Z30,AA30,AB30,2)","v":0.99999999999876554},{"$f":"bint(Z30,AA30,AB30,3)","v":0.99999999999876554},null,17,100,0.2,{"$f":"bint(AH30,AI30,AJ30,0)","v":7.8851380290291304E-2},{"$f":"bint(AH30,AI30,AJ30,1)","v":0.27118896488790772},{"$f":"bint(AH30,AI30,AJ30,2)","v":0.80766241540244732},{"$f":"bint(AH30,AI30,AJ30,3)","v":0.54659516773333316}]
[5,40,0.5,{"$f":"bint(A31,B31,C31,0)","v":5.9845478972419546E-7},{"$f":"bint(A31,B31,C31,1)","v":6.9130601332289484E-7},{"$f":"bint(A31,B31,C31,2)","v":0.99999990714878118},{"$f":"bint(A31,B31,C31,3)","v":0.99999981429755758},{"$f":"binU(A31,B31,C31,3)","v":0.99999981429755758},null,18,20,0.5,{"$f":"bint(J31,K31,L31,0)","v":1.8119812011718766E-4},{"$f":"bint(J31,K31,L31,1)","v":0.99997997283935347},{"$f":"bint(J31,K31,L31,2)","v":2.0122528076171891E-4},null,null,18,50,0.5,{"$f":"bint(R31,S31,T31,0)","v":1.6034754754002078E-2},{"$f":"bint(R31,S31,T31,1)","v":3.2454323536136365E-2},{"$f":"bint(R31,S31,T31,2)","v":0.98358043121787608},{"$f":"bint(R31,S31,T31,3)","v":0.96716086243574184},null,18,100,0.5,{"$f":"bint(Z31,AA31,AB31,0)","v":2.4190033750206169E-11},{"$f":"bint(Z31,AA31,AB31,1)","v":3.0739033075241653E-11},{"$f":"bint(Z31,AA31,AB31,2)","v":0.99999999999351952},{"$f":"bint(Z31,AA31,AB31,3)","v":0.99999999999351952},null,18,100,0.2,{"$f":"bint(AH31,AI31,AJ31,0)","v":9.0898118945752907E-2},{"$f":"bint(AH31,AI31,AJ31,1)","v":0.36208708383366062},{"$f":"bint(AH31,AI31,AJ31,2)","v":0.72881103511215595},{"$f":"bint(AH31,AI31,AJ31,3)","v":0.38284425313679171}]
[6,40,0.5,{"$f":"bint(A32,B32,C32,0)","v":3.4909862733911274E-6},{"$f":"bint(A32,B32,C32,1)","v":4.1822922867140224E-6},{"$f":"bint(A32,B32,C32,2)","v":0.99999930869399145},{"$f":"bint(A32,B32,C32,3)","v":0.99999861738797813},{"$f":"binU(A32,B32,C32,3)","v":0.99999861738797813},null,19,20,0.5,{"$f":"bint(J32,K32,L32,0)","v":1.907348632812499E-5},{"$f":"bint(J32,K32,L32,1)","v":0.9999990463256816},{"$f":"bint(J32,K32,L32,2)","v":2.002716064453124E-5},null,null,19,50,0.5,{"$f":"bint(R32,S32,T32,0)","v":2.7005902743582371E-2},{"$f":"bint(R32,S32,T32,1)","v":5.9460226279718739E-2},{"$f":"bint(R32,S32,T32,2)","v":0.96754567646387402},{"$f":"bint(R32,S32,T32,3)","v":0.93509135292773771},null,19,100,0.5,{"$f":"bint(Z32,AA32,AB32,0)","v":1.0439909302720422E-10},{"$f":"bint(Z32,AA32,AB32,1)","v":1.3513812610244588E-10},{"$f":"bint(Z32,AA32,AB32,2)","v":0.99999999996932931},{"$f":"bint(Z32,AA32,AB32,3)","v":0.99999999996932931},null,19,100,0.2,{"$f":"bint(AH32,AI32,AJ32,0)","v":9.8074286230942304E-2},{"$f":"bint(AH32,AI32,AJ32,1)","v":0.46016137006460289},{"$f":"bint(AH32,AI32,AJ32,2)","v":0.63791291616640311},{"$f":"bint(AH32,AI32,AJ32,3)","v":0.19737450103977119}]
[7,40,0.5,{"$f":"bint(A33,B33,C33,0)","v":1.6956219042185704E-5},{"$f":"bint(A33,B33,C33,1)","v":2.1138511328899727E-5},{"$f":"bint(A33,B33,C33,2)","v":0.99999581770771806},{"$f":"bint(A33,B33,C33,3)","v":0.99999163541543135},{"$f":"binU(A33,B33,C33,3)","v":0.99999163541543135},null,20,20,0.5,{"$f":"bint(J33,K33,L33,0)","v":9.5367431640625E-7},{"$f":"bint(J33,K33,L33,1)","v":0.999999999999998},{"$f":"bint(J33,K33,L33,2)","v":9.5367431640625E-7},null,null,20,50,0.5,{"$f":"bint(R33,S33,T33,0)","v":4.1859149252552512E-2},{"$f":"bint(R33,S33,T33,1)","v":0.10131937553227124},{"$f":"bint(R33,S33,T33,2)","v":0.94053977372029152},{"$f":"bint(R33,S33,T33,3)","v":0.88107954744057304},null,20,100,0.5,{"$f":"bint(Z33,AA33,AB33,0)","v":4.2281632676017335E-10},{"$f":"bint(Z33,AA33,AB33,1)","v":5.5795445286261929E-10},{"$f":"bint(Z33,AA33,AB33,2)","v":0.99999999986493038},{"$f":"bint(Z33,AA33,AB33,3)","v":0.99999999986493038},null,20,100,0.2,{"$f":"bint(AH33,AI33,AJ33,0)","v":9.9300214808828891E-2},{"$f":"bint(AH33,AI33,AJ33,1)","v":0.55946158487343178},{"$f":"bint(AH33,AI33,AJ33,2)","v":0.53983862993546072},{"$f":"bint(AH33,AI33,AJ33,3)","v":9.9300214808828891E-2}]
[8,40,0.5,{"$f":"bint(A34,B34,C34,0)","v":6.9944403549015852E-5},{"$f":"bint(A34,B34,C34,1)","v":9.1082914877915579E-5},{"$f":"bint(A34,B34,C34,2)","v":0.99997886148867587},{"$f":"bint(A34,B34,C34,3)","v":0.99995772297734697},{"$f":"binU(A34,B34,C34,3)","v":0.99995772297734697},null,null,null,null,null,null,null,null,null,21,50,0.5,{"$f":"bint(R34,S34,T34,0)","v":5.9798784646504177E-2},{"$f":"bint(R34,S34,T34,1)","v":0.16111816017877542},{"$f":"bint(R34,S34,T34,2)","v":0.89868062446773911},{"$f":"bint(R34,S34,T34,3)","v":0.797361248935468},null,21,100,0.5,{"$f":"bint(Z34,AA34,AB34,0)","v":1.6107288638483196E-9},{"$f":"bint(Z34,AA34,AB34,1)","v":2.1686833167109387E-9},{"$f":"bint(Z34,AA34,AB34,2)","v":0.99999999944211393},{"$f":"bint(Z34,AA34,AB34,3)","v":0.99999999944211393},null,21,100,0.2,{"$f":"bint(AH34,AI34,AJ34,0)","v":9.4571633151267612E-2},{"$f":"bint(AH34,AI34,AJ34,1)","v":0.65403321802469938},{"$f":"bint(AH34,AI34,AJ34,2)","v":0.44053841512663205},{"$f":"bint(AH34,AI34,AJ34,3)","v":0.29194613419103882}]
[9,40,0.5,{"$f":"bint(A35,B35,C35,0)","v":2.4869121261872297E-4},{"$f":"bint(A35,B35,C35,1)","v":3.3977412749663856E-4},{"$f":"bint(A35,B35,C35,2)","v":0.99990891708512686},{"$f":"bint(A35,B35,C35,3)","v":0.99981783417024894},{"$f":"binU(A35,B35,C35,3)","v":0.99981783417024894},null,null,null,null,null,null,null,null,null,22,50,0.5,{"$f":"bint(R35,S35,T35,0)","v":7.882567067039134E-2},{"$f":"bint(R35,S35,T35,1)","v":0.23994383084916676},{"$f":"bint(R35,S35,T35,2)","v":0.83888183982123488},{"$f":"bint(R35,S35,T35,3)","v":0.67776367964245998},null,22,100,0.5,{"$f":"bint(Z35,AA35,AB35,0)","v":5.7839809201825241E-9},{"$f":"bint(Z35,AA35,AB35,1)","v":7.9526642368934636E-9},{"$f":"bint(Z35,AA35,AB35,2)","v":0.99999999783138505},{"$f":"bint(Z35,AA35,AB35,3)","v":0.99999999783138505},null,22,100,0.2,{"$f":"bint(AH35,AI35,AJ35,0)","v":8.4899534306250135E-2},{"$f":"bint(AH35,AI35,AJ35,1)","v":0.73893275233094946},{"$f":"bint(AH35,AI35,AJ35,2)","v":0.34596678197536457},{"$f":"bint(AH35,AI35,AJ35,3)","v":0.46774378744304185}]
[10,40,0.5,{"$f":"bint(A36,B36,C36,0)","v":7.7094275911803974E-4},{"$f":"bint(A36,B36,C36,1)","v":1.1107168866146782E-3},{"$f":"bint(A36,B36,C36,2)","v":0.99966022587250813},{"$f":"bint(A36,B36,C36,3)","v":0.9993204517450115},{"$f":"binU(A36,B36,C36,3)","v":0.9993204517450115},null,"x","n","p","Bin","Lower p.","Upper p.","Central.p",null,23,50,0.5,{"$f":"bint(R36,S36,T36,0)","v":9.5961686033520094E-2},{"$f":"bint(R36,S36,T36,1)","v":0.33590551688268688},{"$f":"bint(R36,S36,T36,2)","v":0.76005616915084351},{"$f":"bint(R36,S36,T36,3)","v":0.52011233830167747},null,23,100,0.5,{"$f":"bint(Z36,AA36,AB36,0)","v":1.9615239642358246E-8},{"$f":"bint(Z36,AA36,AB36,1)","v":2.7567903879251709E-8},{"$f":"bint(Z36,AA36,AB36,2)","v":0.9999999920474042},{"$f":"bint(Z36,AA36,AB36,3)","v":0.9999999920474042},null,23,100,0.2,{"$f":"bint(AH36,AI36,AJ36,0)","v":7.1980039955299974E-2},{"$f":"bint(AH36,AI36,AJ36,1)","v":0.81091279228624946},{"$f":"bint(AH36,AI36,AJ36,2)","v":0.26106724766911443},{"$f":"bint(AH36,AI36,AJ36,3)","v":0.61857520768863317}]
[11,40,0.5,{"$f":"bint(A37,B37,C37,0)","v":2.102571161231033E-3},{"$f":"bint(A37,B37,C37,1)","v":3.2132880478457112E-3},{"$f":"bint(A37,B37,C37,2)","v":0.9988892831133902},{"$f":"bint(A37,B37,C37,3)","v":0.99777856622677552},{"$f":"binU(A37,B37,C37,3)","v":0.99777856622677552},null,0,10,0.2,{"$f":"binomt(J37,K37,L37,0)","v":0.1073741824},{"$f":"binomt(J37,K37,L37,1)","v":0.1073741824},{"$f":"binomt(J37,K37,L37,2)","v":1},{"$f":"bint(J37,K37,L37,3)","v":0.87912611840000188},null,24,50,0.5,{"$f":"bint(R37,S37,T37,0)","v":0.10795689678771014},{"$f":"bint(R37,S37,T37,1)","v":0.44386241367039703},{"$f":"bint(R37,S37,T37,2)","v":0.66409448311732355},{"$f":"bint(R37,S37,T37,3)","v":0.328188966234638},null,24,100,0.5,{"$f":"bint(Z37,AA37,AB37,0)","v":6.2932227185899406E-8},{"$f":"bint(Z37,AA37,AB37,1)","v":9.0500131065151123E-8},{"$f":"bint(Z37,AA37,AB37,2)","v":0.99999997243216454},{"$f":"bint(Z37,AA37,AB37,3)","v":0.99999997243216454},null,24,100,0.2,{"$f":"bint(AH37,AI37,AJ37,0)","v":5.7733990380813754E-2},{"$f":"bint(AH37,AI37,AJ37,1)","v":0.86864678266706319},{"$f":"bint(AH37,AI37,AJ37,2)","v":0.18908720771381443},{"$f":"bint(AH37,AI37,AJ37,3)","v":0.74014126782825551}]
[12,40,0.5,{"$f":"bint(A38,B38,C38,0)","v":5.0812136396416688E-3},{"$f":"bint(A38,B38,C38,1)","v":8.2945016874873805E-3},{"$f":"bint(A38,B38,C38,2)","v":0.99678671195215907},{"$f":"bint(A38,B38,C38,3)","v":0.99357342390431336},{"$f":"binU(A38,B38,C38,3)","v":0.99357342390431336},null,1,10,0.2,{"$f":"binomt(J38,K38,L38,0)","v":0.26843545600000002},{"$f":"binomt(J38,K38,L38,1)","v":0.3758096384000002},{"$f":"binomt(J38,K38,L38,2)","v":0.89262581760000004},{"$f":"bint(J38,K38,L38,3)","v":0.57042534400000111},null,25,50,0.5,{"$f":"bint(R38,S38,T38,0)","v":0.11227517265921769},{"$f":"bint(R38,S38,T38,1)","v":0.55613758632961474},{"$f":"bint(R38,S38,T38,2)","v":0.5561375863296133},{"$f":"bint(R38,S38,T38,3)","v":0.11227517265921769},null,25,100,0.5,{"$f":"bint(Z38,AA38,AB38,0)","v":1.9131397064514096E-7},{"$f":"bint(Z38,AA38,AB38,1)","v":2.8181410171029208E-7},{"$f":"bint(Z38,AA38,AB38,2)","v":0.99999990949993733},{"$f":"bint(Z38,AA38,AB38,3)","v":0.99999981899980628},null,25,100,0.2,{"$f":"bint(AH38,AI38,AJ38,0)","v":4.3877832689419832E-2},{"$f":"bint(AH38,AI38,AJ38,1)","v":0.91252461535648299},{"$f":"bint(AH38,AI38,AJ38,2)","v":0.13135321733300065},{"$f":"bint(AH38,AI38,AJ38,3)","v":0.83208089421842613}]
[13,40,0.5,{"$f":"bint(A39,B39,C39,0)","v":1.0944152454612872E-2},{"$f":"bint(A39,B39,C39,1)","v":1.9238654142100253E-2},{"$f":"bint(A39,B39,C39,2)","v":0.99170549831251742},{"$f":"bint(A39,B39,C39,3)","v":0.98341099662503006},{"$f":"binU(A39,B39,C39,3)","v":0.98341099662503006},null,2,10,0.2,{"$f":"binomt(J39,K39,L39,0)","v":0.3019898880000001},{"$f":"binomt(J39,K39,L39,1)","v":0.67779952639999996},{"$f":"binomt(J39,K39,L39,2)","v":0.62419036159999974},{"$f":"bint(J39,K39,L39,3)","v":0.30198988800000065},null,26,50,0.5,{"$f":"bint(R39,S39,T39,0)","v":0.10795689678771014},{"$f":"bint(R39,S39,T39,1)","v":0.66409448311732489},{"$f":"bint(R39,S39,T39,2)","v":0.44386241367039558},{"$f":"bint(R39,S39,T39,3)","v":0.328188966234638},null,26,100,0.5,{"$f":"bint(Z39,AA39,AB39,0)","v":5.5186722301482283E-7},{"$f":"bint(Z39,AA39,AB39,1)","v":8.3368132472511491E-7},{"$f":"bint(Z39,AA39,AB39,2)","v":0.99999971818596667},{"$f":"bint(Z39,AA39,AB39,3)","v":0.99999943637186495},null,26,100,0.2,{"$f":"bint(AH39,AI39,AJ39,0)","v":3.1642667804869677E-2},{"$f":"bint(AH39,AI39,AJ39,1)","v":0.94416728316135268},{"$f":"bint(AH39,AI39,AJ39,2)","v":8.7475384643580845E-2},{"$f":"bint(AH39,AI39,AJ39,3)","v":0.89725504600056338}]
[14,40,0.5,{"$f":"bint(A40,B40,C40,0)","v":2.1106579733896062E-2},{"$f":"bint(A40,B40,C40,1)","v":4.0345233875996311E-2},{"$f":"bint(A40,B40,C40,2)","v":0.98076134585790453},{"$f":"bint(A40,B40,C40,3)","v":0.9615226917158044},{"$f":"binU(A40,B40,C40,3)","v":0.9615226917158044},null,3,10,0.2,{"$f":"binomt(J40,K40,L40,0)","v":0.20132659200000003},{"$f":"binomt(J40,K40,L40,1)","v":0.87912611839999999},{"$f":"binomt(J40,K40,L40,2)","v":0.32220047360000004},{"$f":"bint(J40,K40,L40,3)","v":0.7717519360000018},null,27,50,0.5,{"$f":"bint(R40,S40,T40,0)","v":9.5961686033519414E-2},{"$f":"bint(R40,S40,T40,1)","v":0.76005616915084429},{"$f":"bint(R40,S40,T40,2)","v":0.3359055168826855},{"$f":"bint(R40,S40,T40,3)","v":0.52011233830167747},null,27,100,0.5,{"$f":"bint(Z40,AA40,AB40,0)","v":1.5125249815961856E-6},{"$f":"bint(Z40,AA40,AB40,1)","v":2.3462063063213007E-6},{"$f":"bint(Z40,AA40,AB40,2)","v":0.99999916631874364},{"$f":"bint(Z40,AA40,AB40,3)","v":0.99999833263741889},null,27,100,0.2,{"$f":"bint(AH40,AI40,AJ40,0)","v":2.1681087199633065E-2},{"$f":"bint(AH40,AI40,AJ40,1)","v":0.9658483703609857},{"$f":"bint(AH40,AI40,AJ40,2)","v":5.5832716838711174E-2},{"$f":"bint(AH40,AI40,AJ40,3)","v":0.9189361332001964}]
[15,40,0.5,{"$f":"bint(A41,B41,C41,0)","v":3.6584738205419812E-2},{"$f":"bint(A41,B41,C41,1)","v":7.6929972081416123E-2},{"$f":"bint(A41,B41,C41,2)","v":0.95965476612400846},{"$f":"bint(A41,B41,C41,3)","v":0.91930953224801215},{"$f":"binU(A41,B41,C41,3)","v":0.91930953224801215},null,4,10,0.2,{"$f":"binomt(J41,K41,L41,0)","v":8.8080384000000025E-2},{"$f":"binomt(J41,K41,L41,1)","v":0.96720650240000006},{"$f":"binomt(J41,K41,L41,2)","v":0.12087388160000001},{"$f":"bint(J41,K41,L41,3)","v":0.96720650240000217},null,28,50,0.5,{"$f":"bint(R41,S41,T41,0)","v":7.8825670670391201E-2},{"$f":"bint(R41,S41,T41,1)","v":0.83888183982123543},{"$f":"bint(R41,S41,T41,2)","v":0.23994383084916607},{"$f":"bint(R41,S41,T41,3)","v":0.67776367964245998},null,28,100,0.5,{"$f":"bint(Z41,AA41,AB41,0)","v":3.9433687020186953E-6},{"$f":"bint(Z41,AA41,AB41,1)","v":6.2895750083399963E-6},{"$f":"bint(Z41,AA41,AB41,2)","v":0.99999765379376215},{"$f":"bint(Z41,AA41,AB41,3)","v":0.99999530758745581},null,28,100,0.2,{"$f":"bint(AH41,AI41,AJ41,0)","v":1.4131422906903784E-2},{"$f":"bint(AH41,AI41,AJ41,1)","v":0.97997979326788953},{"$f":"bint(AH41,AI41,AJ41,2)","v":3.4151629639078106E-2},{"$f":"bint(AH41,AI41,AJ41,3)","v":0.95465104004649093}]
[16,40,0.5,{"$f":"bint(A42,B42,C42,0)","v":5.7163653445968854E-2},{"$f":"bint(A42,B42,C42,1)","v":0.13409362552738496},{"$f":"bint(A42,B42,C42,2)","v":0.92307002791858861},{"$f":"bint(A42,B42,C42,3)","v":0.84614005583717233},{"$f":"binU(A42,B42,C42,3)","v":0.84614005583717233},null,5,10,0.2,{"$f":"binomt(J42,K42,L42,0)","v":2.6424115200000015E-2},{"$f":"binomt(J42,K42,L42,1)","v":0.99363061760000004},{"$f":"binomt(J42,K42,L42,2)","v":3.2793497599999943E-2},{"$f":"bint(J42,K42,L42,3)","v":0.99363061760000226},null,29,50,0.5,{"$f":"bint(R42,S42,T42,0)","v":5.9798784646503754E-2},{"$f":"bint(R42,S42,T42,1)","v":0.89868062446773922},{"$f":"bint(R42,S42,T42,2)","v":0.16111816017877487},{"$f":"bint(R42,S42,T42,3)","v":0.797361248935468},null,29,100,0.5,{"$f":"bint(Z42,AA42,AB42,0)","v":9.7904326394948331E-6},{"$f":"bint(Z42,AA42,AB42,1)","v":1.6080007647834828E-5},{"$f":"bint(Z42,AA42,AB42,2)","v":0.99999371042506013},{"$f":"bint(Z42,AA42,AB42,3)","v":0.99998742085005177},null,29,100,0.2,{"$f":"bint(AH42,AI42,AJ42,0)","v":8.7712280111818166E-3},{"$f":"bint(AH42,AI42,AJ42,1)","v":0.98875102127907133},{"$f":"bint(AH42,AI42,AJ42,2)","v":2.0020206732174334E-2},{"$f":"bint(AH42,AI42,AJ42,3)","v":0.97617614493094895}]
[17,40,0.5,{"$f":"bint(A43,B43,C43,0)","v":8.0701628394308861E-2},{"$f":"bint(A43,B43,C43,1)","v":0.21479525392169382},{"$f":"bint(A43,B43,C43,2)","v":0.86590637447261976},{"$f":"bint(A43,B43,C43,3)","v":0.73181274894523485},{"$f":"binU(A43,B43,C43,3)","v":0.73181274894523485},null,6,10,0.2,{"$f":"binomt(J43,K43,L43,0)","v":5.5050240000000016E-3},{"$f":"binomt(J43,K43,L43,1)","v":0.99913564160000001},{"$f":"binomt(J43,K43,L43,2)","v":6.3693823999999566E-3},{"$f":"bint(J43,K43,L43,3)","v":0.99913564160000223},null,30,50,0.5,{"$f":"bint(R43,S43,T43,0)","v":4.1859149252552588E-2},{"$f":"bint(R43,S43,T43,1)","v":0.94053977372029185},{"$f":"bint(R43,S43,T43,2)","v":0.10131937553227109},{"$f":"bint(R43,S43,T43,3)","v":0.88107954744057304},null,30,100,0.5,{"$f":"bint(Z43,AA43,AB43,0)","v":2.3170690580136546E-5},{"$f":"bint(Z43,AA43,AB43,1)","v":3.9250698227971377E-5},{"$f":"bint(Z43,AA43,AB43,2)","v":0.99998391999242064},{"$f":"bint(Z43,AA43,AB43,3)","v":0.99996783998477279},null,30,100,0.2,{"$f":"bint(AH43,AI43,AJ43,0)","v":5.1896432399489573E-3},{"$f":"bint(AH43,AI43,AJ43,1)","v":0.9939406645190203},{"$f":"bint(AH43,AI43,AJ43,2)","v":1.1248978720992505E-2},{"$f":"bint(AH43,AI43,AJ43,3)","v":0.98824428356322658}]
[18,40,0.5,{"$f":"bint(A44,B44,C44,0)","v":0.10311874739272829},{"$f":"bint(A44,B44,C44,1)","v":0.3179140013144221},{"$f":"bint(A44,B44,C44,2)","v":0.78520474607831092},{"$f":"bint(A44,B44,C44,3)","v":0.57040949215661718},{"$f":"binU(A44,B44,C44,3)","v":0.57040949215661718},null,7,10,0.2,{"$f":"binomt(J44,K44,L44,0)","v":7.8643199999999956E-4},{"$f":"binomt(J44,K44,L44,1)","v":0.99992207360000007},{"$f":"binomt(J44,K44,L44,2)","v":8.6435839999998709E-4},{"$f":"bint(J44,K44,L44,3)","v":0.99992207360000218},null,31,50,0.5,{"$f":"bint(R44,S44,T44,0)","v":2.700590274358218E-2},{"$f":"bint(R44,S44,T44,1)","v":0.96754567646387402},{"$f":"bint(R44,S44,T44,2)","v":5.9460226279718517E-2},{"$f":"bint(R44,S44,T44,3)","v":0.93509135292773771},null,31,100,0.5,{"$f":"bint(Z44,AA44,AB44,0)","v":5.232091421321325E-5},{"$f":"bint(Z44,AA44,AB44,1)","v":9.1571612441184634E-5},{"$f":"bint(Z44,AA44,AB44,2)","v":0.99996074930184042},{"$f":"bint(Z44,AA44,AB44,3)","v":0.99992149860361246},null,31,100,0.2,{"$f":"bint(AH44,AI44,AJ44,0)","v":2.9296373128745419E-3},{"$f":"bint(AH44,AI44,AJ44,1)","v":0.99687030183189485},{"$f":"bint(AH44,AI44,AJ44,2)","v":6.0593354810435469E-3},{"$f":"bint(AH44,AI44,AJ44,3)","v":0.99453674084568389}]
[19,40,0.5,{"$f":"bint(A45,B45,C45,0)","v":0.11940065487579006},{"$f":"bint(A45,B45,C45,1)","v":0.43731465619021215},{"$f":"bint(A45,B45,C45,2)","v":0.68208599868558262},{"$f":"bint(A45,B45,C45,3)","v":0.36417199737116057},{"$f":"binU(A45,B45,C45,3)","v":0.36417199737116057},null,8,10,0.2,{"$f":"binomt(J45,K45,L45,0)","v":7.3728000000000132E-5},{"$f":"binomt(J45,K45,L45,1)","v":0.99999580160000001},{"$f":"binomt(J45,K45,L45,2)","v":7.7926399999928009E-5},{"$f":"bint(J45,K45,L45,3)","v":0.99999580160000223},null,32,50,0.5,{"$f":"bint(R45,S45,T45,0)","v":1.603475475400205E-2},{"$f":"bint(R45,S45,T45,1)","v":0.98358043121787608},{"$f":"bint(R45,S45,T45,2)","v":3.245432353613633E-2},{"$f":"bint(R45,S45,T45,3)","v":0.96716086243574184},null,32,100,0.5,{"$f":"bint(Z45,AA45,AB45,0)","v":1.1281697127224054E-4},{"$f":"bint(Z45,AA45,AB45,1)","v":2.0438858371342518E-4},{"$f":"bint(Z45,AA45,AB45,2)","v":0.99990842838762728},{"$f":"bint(Z45,AA45,AB45,3)","v":0.99981685677518606},null,32,100,0.2,{"$f":"bint(AH45,AI45,AJ45,0)","v":1.5792576139714196E-3},{"$f":"bint(AH45,AI45,AJ45,1)","v":0.99844955944586622},{"$f":"bint(AH45,AI45,AJ45,2)","v":3.1296981681690058E-3},{"$f":"bint(AH45,AI45,AJ45,3)","v":0.99611599845965526}]
[20,40,0.5,{"$f":"bint(A46,B46,C46,0)","v":0.12537068761958048},{"$f":"bint(A46,B46,C46,1)","v":0.56268534380979263},{"$f":"bint(A46,B46,C46,2)","v":0.56268534380979263},{"$f":"bint(A46,B46,C46,3)","v":0.12537068761958048},{"$f":"binU(A46,B46,C46,3)","v":0.12537068761958048},null,9,10,0.2,{"$f":"binomt(J46,K46,L46,0)","v":4.0959999999999935E-6},{"$f":"binomt(J46,K46,L46,1)","v":0.99999989759999997},{"$f":"binomt(J46,K46,L46,2)","v":4.1983999999883892E-6},{"$f":"bint(J46,K46,L46,3)","v":0.99999989760000219},null,33,50,0.5,{"$f":"bint(R46,S46,T46,0)","v":8.7462298658192335E-3},{"$f":"bint(R46,S46,T46,1)","v":0.99232666108369527},{"$f":"bint(R46,S46,T46,2)","v":1.6419568782134283E-2},{"$f":"bint(R46,S46,T46,3)","v":0.98465332216738022},null,33,100,0.5,{"$f":"bint(Z46,AA46,AB46,0)","v":2.32471334742797E-4},{"$f":"bint(Z46,AA46,AB46,1)","v":4.3685991845622215E-4},{"$f":"bint(Z46,AA46,AB46,2)","v":0.99979561141635498},{"$f":"bint(Z46,AA46,AB46,3)","v":0.99959122283264157},null,33,100,0.2,{"$f":"bint(AH46,AI46,AJ46,0)","v":8.135569526519287E-4},{"$f":"bint(AH46,AI46,AJ46,1)","v":0.99926311639851817},{"$f":"bint(AH46,AI46,AJ46,2)","v":1.5504405541975873E-3},{"$f":"bint(AH46,AI46,AJ46,3)","v":0.9984077180362998}]
[21,40,0.5,{"$f":"bint(A47,B47,C47,0)","v":0.11940065487579006},{"$f":"bint(A47,B47,C47,1)","v":0.68208599868558273},{"$f":"bint(A47,B47,C47,2)","v":0.43731465619021209},{"$f":"bint(A47,B47,C47,3)","v":0.36417199737116057},{"$f":"binU(A47,B47,C47,3)","v":0.36417199737116057},null,10,10,0.2,{"$f":"binomt(J47,K47,L47,0)","v":1.0240000000000004E-7},{"$f":"binomt(J47,K47,L47,1)","v":1},{"$f":"binomt(J47,K47,L47,2)","v":1.02400000034919E-7},{"$f":"bint(J47,K47,L47,3)","v":1.0000000000000022},null,34,50,0.5,{"$f":"bint(R47,S47,T47,0)","v":4.3731149329095846E-3},{"$f":"bint(R47,S47,T47,1)","v":0.99669977601660487},{"$f":"bint(R47,S47,T47,2)","v":7.6733389163150516E-3},{"$f":"bint(R47,S47,T47,3)","v":0.99339955203319941},null,34,100,0.5,{"$f":"bint(Z47,AA47,AB47,0)","v":4.5810527728726893E-4},{"$f":"bint(Z47,AA47,AB47,1)","v":8.9496519574349103E-4},{"$f":"bint(Z47,AA47,AB47,2)","v":0.99956314008161218},{"$f":"bint(Z47,AA47,AB47,3)","v":0.99912628016315597},null,34,100,0.2,{"$f":"bint(AH47,AI47,AJ47,0)","v":4.0079643990940147E-4},{"$f":"bint(AH47,AI47,AJ47,1)","v":0.99966391283842759},{"$f":"bint(AH47,AI47,AJ47,2)","v":7.3688360154565793E-4},{"$f":"bint(AH47,AI47,AJ47,3)","v":0.99938692593777156}]
[22,40,0.5,{"$f":"bint(A48,B48,C48,0)","v":0.10311874739272829},{"$f":"bint(A48,B48,C48,1)","v":0.78520474607831103},{"$f":"bint(A48,B48,C48,2)","v":0.31791400131442199},{"$f":"bint(A48,B48,C48,3)","v":0.57040949215661718},{"$f":"binU(A48,B48,C48,3)","v":0.57040949215661718},null,null,null,null,null,null,null,null,null,35,50,0.5,{"$f":"bint(R48,S48,T48,0)","v":1.9991382550443907E-3},{"$f":"bint(R48,S48,T48,1)","v":0.99869891427164925},{"$f":"bint(R48,S48,T48,2)","v":3.300223983405467E-3},{"$f":"bint(R48,S48,T48,3)","v":0.99739782854328818},null,35,100,0.5,{"$f":"bint(Z48,AA48,AB48,0)","v":8.6385566574172874E-4},{"$f":"bint(Z48,AA48,AB48,1)","v":1.7588208614852199E-3},{"$f":"bint(Z48,AA48,AB48,2)","v":0.999105034804325},{"$f":"bint(Z48,AA48,AB48,3)","v":0.9982100696085815},null,35,100,0.2,{"$f":"bint(AH48,AI48,AJ48,0)","v":1.889468931001508E-4},{"$f":"bint(AH48,AI48,AJ48,1)","v":0.99985285973152771},{"$f":"bint(AH48,AI48,AJ48,2)","v":3.3608716163625635E-4},{"$f":"bint(AH48,AI48,AJ48,3)","v":0.99977489612947368}]
[23,40,0.5,{"$f":"bint(A49,B49,C49,0)","v":8.0701628394308861E-2},{"$f":"bint(A49,B49,C49,1)","v":0.86590637447261987},{"$f":"bint(A49,B49,C49,2)","v":0.21479525392169377},{"$f":"bint(A49,B49,C49,3)","v":0.73181274894523485},{"$f":"binU(A49,B49,C49,3)","v":0.73181274894523485},null,"x","n","p","Bin","Lower p.","Upper p.",null,null,36,50,0.5,{"$f":"bint(R49,S49,T49,0)","v":8.3297427293516253E-4},{"$f":"bint(R49,S49,T49,1)","v":0.99953188854458441},{"$f":"bint(R49,S49,T49,2)","v":1.3010857283610763E-3},{"$f":"bint(R49,S49,T49,3)","v":0.9990637770891585},null,36,100,0.5,{"$f":"bint(Z49,AA49,AB49,0)","v":1.5597393964781377E-3},{"$f":"bint(Z49,AA49,AB49,1)","v":3.3185602579633576E-3},{"$f":"bint(Z49,AA49,AB49,2)","v":0.99824117913858312},{"$f":"bint(Z49,AA49,AB49,3)","v":0.99648235827709786},null,36,100,0.2,{"$f":"bint(AH49,AI49,AJ49,0)","v":8.5288528135485907E-5},{"$f":"bint(AH49,AI49,AJ49,1)","v":0.99993814825966321},{"$f":"bint(AH49,AI49,AJ49,2)","v":1.471402685361056E-4},{"$f":"bint(AH49,AI49,AJ49,3)","v":0.99986018465760917}]
[24,40,0.5,{"$f":"bint(A50,B50,C50,0)","v":5.7163653445968653E-2},{"$f":"bint(A50,B50,C50,1)","v":0.9230700279185885},{"$f":"bint(A50,B50,C50,2)","v":0.13409362552738491},{"$f":"bint(A50,B50,C50,3)","v":0.84614005583717233},{"$f":"binU(A50,B50,C50,3)","v":0.78897640239120348},null,0,13,0.5,{"$f":"binomt(J50,K50,L50,0)","v":1.2207031250000008E-4},{"$f":"binomt(J50,K50,L50,1)","v":1.2207031250000008E-4},{"$f":"binomt(J50,K50,L50,2)","v":1},null,null,37,50,0.5,{"$f":"bint(R50,S50,T50,0)","v":3.1517945462411576E-4},{"$f":"bint(R50,S50,T50,1)","v":0.99984706799920853},{"$f":"bint(R50,S50,T50,2)","v":4.68111455425914E-4},{"$f":"bint(R50,S50,T50,3)","v":0.99969413599840673},null,37,100,0.5,{"$f":"bint(Z50,AA50,AB50,0)","v":2.697927604718891E-3},{"$f":"bint(Z50,AA50,AB50,1)","v":6.0164878626822486E-3},{"$f":"bint(Z50,AA50,AB50,2)","v":0.99668143974210499},{"$f":"bint(Z50,AA50,AB50,3)","v":0.99336287948414159},null,37,100,0.2,{"$f":"bint(AH50,AI50,AJ50,0)","v":3.6881525680209304E-5},{"$f":"bint(AH50,AI50,AJ50,1)","v":0.99997502978534336},{"$f":"bint(AH50,AI50,AJ50,2)","v":6.1851740400619722E-5},{"$f":"bint(AH50,AI50,AJ50,3)","v":0.99995634971904312}]
[25,40,0.5,{"$f":"bint(A51,B51,C51,0)","v":3.6584738205419944E-2},{"$f":"bint(A51,B51,C51,1)","v":0.95965476612400846},{"$f":"bint(A51,B51,C51,2)","v":7.6929972081416248E-2},{"$f":"bint(A51,B51,C51,3)","v":0.91930953224801215},{"$f":"binU(A51,B51,C51,3)","v":0.91930953224801215},null,1,13,0.5,{"$f":"binomt(J51,K51,L51,0)","v":1.5869140625000009E-3},{"$f":"binomt(J51,K51,L51,1)","v":1.7089843750000002E-3},{"$f":"binomt(J51,K51,L51,2)","v":0.9998779296875},null,null,38,50,0.5,{"$f":"bint(R51,S51,T51,0)","v":1.0782455026614503E-4},{"$f":"bint(R51,S51,T51,1)","v":0.99995489254947467},{"$f":"bint(R51,S51,T51,2)","v":1.5293200080179821E-4},{"$f":"bint(R51,S51,T51,3)","v":0.99990978509893902},null,38,100,0.5,{"$f":"bint(Z51,AA51,AB51,0)","v":4.4728799762445452E-3},{"$f":"bint(Z51,AA51,AB51,1)","v":1.0489367838926794E-2},{"$f":"bint(Z51,AA51,AB51,2)","v":0.99398351213738623},{"$f":"bint(Z51,AA51,AB51,3)","v":0.98796702427470395},null,38,100,0.2,{"$f":"bint(AH51,AI51,AJ51,0)","v":1.5286421827981798E-5},{"$f":"bint(AH51,AI51,AJ51,1)","v":0.99999031620717138},{"$f":"bint(AH51,AI51,AJ51,2)","v":2.4970214720410428E-5},{"$f":"bint(AH51,AI51,AJ51,3)","v":0.99997163614087115}]
[26,40,0.5,{"$f":"bint(A52,B52,C52,0)","v":2.1106579733896135E-2},{"$f":"bint(A52,B52,C52,1)","v":0.98076134585790464},{"$f":"bint(A52,B52,C52,2)","v":4.0345233875996311E-2},{"$f":"bint(A52,B52,C52,3)","v":0.9615226917158044},{"$f":"binU(A52,B52,C52,3)","v":0.9615226917158044},null,2,13,0.5,{"$f":"binomt(J52,K52,L52,0)","v":9.5214843750000035E-3},{"$f":"binomt(J52,K52,L52,1)","v":1.1230468750000002E-2},{"$f":"binomt(J52,K52,L52,2)","v":0.998291015625},null,null,39,50,0.5,{"$f":"bint(R52,S52,T52,0)","v":3.3176784697275354E-5},{"$f":"bint(R52,S52,T52,1)","v":0.99998806933417195},{"$f":"bint(R52,S52,T52,2)","v":4.5107450535653192E-5},{"$f":"bint(R52,S52,T52,3)","v":0.99997613866833357},null,39,100,0.5,{"$f":"bint(Z52,AA52,AB52,0)","v":7.110732269927025E-3},{"$f":"bint(Z52,AA52,AB52,1)","v":1.7600100108853819E-2},{"$f":"bint(Z52,AA52,AB52,2)","v":0.98951063216114166},{"$f":"bint(Z52,AA52,AB52,3)","v":0.97902126432221481},null,39,100,0.2,{"$f":"bint(AH52,AI52,AJ52,0)","v":6.0753727777874977E-6},{"$f":"bint(AH52,AI52,AJ52,1)","v":0.99999639157994913},{"$f":"bint(AH52,AI52,AJ52,2)","v":9.6837928924286262E-6},{"$f":"bint(AH52,AI52,AJ52,3)","v":0.99999268840689204}]
[27,40,0.5,{"$f":"bint(A53,B53,C53,0)","v":1.0944152454612794E-2},{"$f":"bint(A53,B53,C53,1)","v":0.99170549831251742},{"$f":"bint(A53,B53,C53,2)","v":1.923865414210018E-2},{"$f":"bint(A53,B53,C53,3)","v":0.98341099662503006},{"$f":"binU(A53,B53,C53,3)","v":0.98341099662503006},null,3,13,0.5,{"$f":"binomt(J53,K53,L53,0)","v":3.4912109374999979E-2},{"$f":"binomt(J53,K53,L53,1)","v":4.6142578125000014E-2},{"$f":"binomt(J53,K53,L53,2)","v":0.98876953125},null,null,40,50,0.5,{"$f":"bint(R53,S53,T53,0)","v":9.1236157917507283E-6},{"$f":"bint(R53,S53,T53,1)","v":0.9999971929499637},{"$f":"bint(R53,S53,T53,2)","v":1.1930665838377839E-5},{"$f":"bint(R53,S53,T53,3)","v":0.99999438589991707},null,40,100,0.5,{"$f":"bint(Z53,AA53,AB53,0)","v":1.0843866711638651E-2},{"$f":"bint(Z53,AA53,AB53,1)","v":2.844396682049247E-2},{"$f":"bint(Z53,AA53,AB53,2)","v":0.98239989989121457},{"$f":"bint(Z53,AA53,AB53,3)","v":0.96479979978236052},null,40,100,0.2,{"$f":"bint(AH53,AI53,AJ53,0)","v":2.3162358715314617E-6},{"$f":"bint(AH53,AI53,AJ53,1)","v":0.99999870781582068},{"$f":"bint(AH53,AI53,AJ53,2)","v":3.6084201146411294E-6},{"$f":"bint(AH53,AI53,AJ53,3)","v":0.99999812482885575}]
[28,40,0.5,{"$f":"bint(A54,B54,C54,0)","v":5.0812136396416688E-3},{"$f":"bint(A54,B54,C54,1)","v":0.99678671195215907},{"$f":"bint(A54,B54,C54,2)","v":8.2945016874873823E-3},{"$f":"bint(A54,B54,C54,3)","v":0.99357342390431336},{"$f":"binU(A54,B54,C54,3)","v":0.98849221026467171},null,4,13,0.5,{"$f":"binomt(J54,K54,L54,0)","v":8.72802734375E-2},{"$f":"binomt(J54,K54,L54,1)","v":0.13342285156250006},{"$f":"binomt(J54,K54,L54,2)","v":0.953857421875},null,null,41,50,0.5,{"$f":"bint(R54,S54,T54,0)","v":2.2252721443294698E-6},{"$f":"bint(R54,S54,T54,1)","v":0.99999941822210803},{"$f":"bint(R54,S54,T54,2)","v":2.807050046627111E-6},{"$f":"bint(R54,S54,T54,3)","v":0.99999883644420573},null,41,100,0.5,{"$f":"bint(Z54,AA54,AB54,0)","v":1.5869073236544868E-2},{"$f":"bint(Z54,AA54,AB54,1)","v":4.4313040057037338E-2},{"$f":"bint(Z54,AA54,AB54,2)","v":0.97155603317957595},{"$f":"bint(Z54,AA54,AB54,3)","v":0.94311206635908307},null,41,100,0.2,{"$f":"bint(AH54,AI54,AJ54,0)","v":8.4740336763347918E-7},{"$f":"bint(AH54,AI54,AJ54,1)","v":0.99999955521918826},{"$f":"bint(AH54,AI54,AJ54,2)","v":1.2921842431096683E-6},{"$f":"bint(AH54,AI54,AJ54,3)","v":0.99999897223222334}]
[29,40,0.5,{"$f":"bint(A55,B55,C55,0)","v":2.1025711612310313E-3},{"$f":"bint(A55,B55,C55,1)","v":0.99888928311339009},{"$f":"bint(A55,B55,C55,2)","v":3.2132880478457134E-3},{"$f":"bint(A55,B55,C55,3)","v":0.99777856622677552},{"$f":"binU(A55,B55,C55,3)","v":0.99777856622677552},null,5,13,0.5,{"$f":"binomt(J55,K55,L55,0)","v":0.15710449218750006},{"$f":"binomt(J55,K55,L55,1)","v":0.29052734375},{"$f":"binomt(J55,K55,L55,2)","v":0.8665771484375},null,null,42,50,0.5,{"$f":"bint(R55,S55,T55,0)","v":4.7684403092774564E-7},{"$f":"bint(R55,S55,T55,1)","v":0.99999989506613896},{"$f":"bint(R55,S55,T55,2)","v":5.8177790229764153E-7},{"$f":"bint(R55,S55,T55,3)","v":0.99999979013226759},null,42,100,0.5,{"$f":"bint(Z55,AA55,AB55,0)","v":2.229226954657473E-2},{"$f":"bint(Z55,AA55,AB55,1)","v":6.6605309603612065E-2},{"$f":"bint(Z55,AA55,AB55,2)","v":0.95568695994303099},{"$f":"bint(Z55,AA55,AB55,3)","v":0.91137391988599348},null,42,100,0.2,{"$f":"bint(AH55,AI55,AJ55,0)","v":2.9759999220461774E-7},{"$f":"bint(AH55,AI55,AJ55,1)","v":0.99999985281918047},{"$f":"bint(AH55,AI55,AJ55,2)","v":4.4478087547618883E-7},{"$f":"bint(AH55,AI55,AJ55,3)","v":0.99999978450208649}]
[30,40,0.5,{"$f":"bint(A56,B56,C56,0)","v":7.709427591180431E-4},{"$f":"bint(A56,B56,C56,1)","v":0.99966022587250813},{"$f":"bint(A56,B56,C56,2)","v":1.1107168866146822E-3},{"$f":"bint(A56,B56,C56,3)","v":0.9993204517450115},{"$f":"binU(A56,B56,C56,3)","v":0.99854950898589356},null,6,13,0.5,{"$f":"binomt(J56,K56,L56,0)","v":0.20947265625},{"$f":"binomt(J56,K56,L56,1)","v":0.49999999999999989},{"$f":"binomt(J56,K56,L56,2)","v":0.70947265625},null,null,43,50,0.5,{"$f":"bint(R56,S56,T56,0)","v":8.8715168544696459E-8},{"$f":"bint(R56,S56,T56,1)","v":0.9999999837813075},{"$f":"bint(R56,S56,T56,2)","v":1.0493387136989591E-7},{"$f":"bint(R56,S56,T56,3)","v":0.9999999837813075},null,43,100,0.5,{"$f":"bint(Z56,AA56,AB56,0)","v":3.0068642644216312E-2},{"$f":"bint(Z56,AA56,AB56,1)","v":9.6673952247828376E-2},{"$f":"bint(Z56,AA56,AB56,2)","v":0.93339469039645639},{"$f":"bint(Z56,AA56,AB56,3)","v":0.86678938079284418},null,43,100,0.2,{"$f":"bint(AH56,AI56,AJ56,0)","v":1.0035348574341415E-7},{"$f":"bint(AH56,AI56,AJ56,1)","v":0.99999995317266621},{"$f":"bint(AH56,AI56,AJ56,2)","v":1.4718088327157112E-7},{"$f":"bint(AH56,AI56,AJ56,3)","v":0.99999988485557223}]
[31,40,0.5,{"$f":"bint(A57,B57,C57,0)","v":2.4869121261872297E-4},{"$f":"bint(A57,B57,C57,1)","v":0.99990891708512686},{"$f":"bint(A57,B57,C57,2)","v":3.397741274966391E-4},{"$f":"bint(A57,B57,C57,3)","v":0.99981783417024894},{"$f":"binU(A57,B57,C57,3)","v":0.99981783417024894},null,7,13,0.5,{"$f":"binomt(J57,K57,L57,0)","v":0.20947265625},{"$f":"binomt(J57,K57,L57,1)","v":0.70947265625},{"$f":"binomt(J57,K57,L57,2)","v":0.50000000000000011},null,null,44,50,0.5,{"$f":"bint(R57,S57,T57,0)","v":1.4113776813928982E-8},{"$f":"bint(R57,S57,T57,1)","v":0.99999999789508431},{"$f":"bint(R57,S57,T57,2)","v":1.6218702825199454E-8},{"$f":"bint(R57,S57,T57,3)","v":0.99999999789508431},null,44,100,0.5,{"$f":"bint(Z57,AA57,AB57,0)","v":3.8952559789099818E-2},{"$f":"bint(Z57,AA57,AB57,1)","v":0.13562651203692819},{"$f":"bint(Z57,AA57,AB57,2)","v":0.90332604775224012},{"$f":"bint(Z57,AA57,AB57,3)","v":0.8066520955044113},null,44,100,0.2,{"$f":"bint(AH57,AI57,AJ57,0)","v":3.2500844814629501E-8},{"$f":"bint(AH57,AI57,AJ57,1)","v":0.999999985673511},{"$f":"bint(AH57,AI57,AJ57,2)","v":4.6827397528157022E-8},{"$f":"bint(AH57,AI57,AJ57,3)","v":0.999999985673511}]
[32,40,0.5,{"$f":"bint(A58,B58,C58,0)","v":6.9944403549016354E-5},{"$f":"bint(A58,B58,C58,1)","v":0.99997886148867587},{"$f":"bint(A58,B58,C58,2)","v":9.1082914877916121E-5},{"$f":"bint(A58,B58,C58,3)","v":0.99995772297734697},{"$f":"binU(A58,B58,C58,3)","v":0.99988777857379796},null,8,13,0.5,{"$f":"binomt(J58,K58,L58,0)","v":0.15710449218750006},{"$f":"binomt(J58,K58,L58,1)","v":0.8665771484375},{"$f":"binomt(J58,K58,L58,2)","v":0.29052734375},null,null,45,50,0.5,{"$f":"bint(R58,S58,T58,0)","v":1.8818369085238733E-9},{"$f":"bint(R58,S58,T58,1)","v":0.99999999977692122},{"$f":"bint(R58,S58,T58,2)","v":2.1049260112704732E-9},{"$f":"bint(R58,S58,T58,3)","v":0.99999999977692122},null,45,100,0.5,{"$f":"bint(Z58,AA58,AB58,0)","v":4.8474296626434057E-2},{"$f":"bint(Z58,AA58,AB58,1)","v":0.18410080866336226},{"$f":"bint(Z58,AA58,AB58,2)","v":0.86437348796314017},{"$f":"bint(Z58,AA58,AB58,3)","v":0.72874697592621218},null,45,100,0.2,{"$f":"bint(AH58,AI58,AJ58,0)","v":1.0111373942328877E-8},{"$f":"bint(AH58,AI58,AJ58,1)","v":0.99999999578488497},{"$f":"bint(AH58,AI58,AJ58,2)","v":1.4326552713527514E-8},{"$f":"bint(AH58,AI58,AJ58,3)","v":0.99999999578488497}]
[33,40,0.5,{"$f":"bint(A59,B59,C59,0)","v":1.6956219042185704E-5},{"$f":"bint(A59,B59,C59,1)","v":0.99999581770771806},{"$f":"bint(A59,B59,C59,2)","v":2.1138511328899757E-5},{"$f":"bint(A59,B59,C59,3)","v":0.99999163541543135},{"$f":"binU(A59,B59,C59,3)","v":0.99999163541543135},null,9,13,0.5,{"$f":"binomt(J59,K59,L59,0)","v":8.7280273437500028E-2},{"$f":"binomt(J59,K59,L59,1)","v":0.953857421875},{"$f":"binomt(J59,K59,L59,2)","v":0.1334228515625},null,null,46,50,0.5,{"$f":"bint(R59,S59,T59,0)","v":2.0454749005694006E-10},{"$f":"bint(R59,S59,T59,1)","v":0.99999999998146871},{"$f":"bint(R59,S59,T59,2)","v":2.230891027465999E-10},{"$f":"bint(R59,S59,T59,3)","v":0.99999999998146871},null,46,100,0.5,{"$f":"bint(Z59,AA59,AB59,0)","v":5.7958398140301348E-2},{"$f":"bint(Z59,AA59,AB59,1)","v":0.24205920680366361},{"$f":"bint(Z59,AA59,AB59,2)","v":0.81589919133670608},{"$f":"bint(Z59,AA59,AB59,3)","v":0.63179838267334398},null,46,100,0.2,{"$f":"bint(AH59,AI59,AJ59,0)","v":3.0224215588483027E-9},{"$f":"bint(AH59,AI59,AJ59,1)","v":0.9999999988073065},{"$f":"bint(AH59,AI59,AJ59,2)","v":4.2151787711986397E-9},{"$f":"bint(AH59,AI59,AJ59,3)","v":0.9999999988073065}]
[34,40,0.5,{"$f":"bint(A60,B60,C60,0)","v":3.4909862733911524E-6},{"$f":"bint(A60,B60,C60,1)","v":0.99999930869399145},{"$f":"bint(A60,B60,C60,2)","v":4.1822922867140521E-6},{"$f":"bint(A60,B60,C60,3)","v":0.99999861738797813},{"$f":"binU(A60,B60,C60,3)","v":0.99999861738797813},null,10,13,0.5,{"$f":"binomt(J60,K60,L60,0)","v":3.4912109374999979E-2},{"$f":"binomt(J60,K60,L60,1)","v":0.98876953125},{"$f":"binomt(J60,K60,L60,2)","v":4.6142578125E-2},null,null,47,50,0.5,{"$f":"bint(R60,S60,T60,0)","v":1.7408297026122487E-11},{"$f":"bint(R60,S60,T60,1)","v":0.99999999999887701},{"$f":"bint(R60,S60,T60,2)","v":1.8541612689659843E-11},{"$f":"bint(R60,S60,T60,3)","v":0.99999999999887701},null,47,100,0.5,{"$f":"bint(Z60,AA60,AB60,0)","v":6.659049999098389E-2},{"$f":"bint(Z60,AA60,AB60,1)","v":0.30864970679464748},{"$f":"bint(Z60,AA60,AB60,2)","v":0.75794079319640473},{"$f":"bint(Z60,AA60,AB60,3)","v":0.51588158639274129},null,47,100,0.2,{"$f":"bint(AH60,AI60,AJ60,0)","v":8.6814236264792067E-10},{"$f":"bint(AH60,AI60,AJ60,1)","v":0.99999999967544884},{"$f":"bint(AH60,AI60,AJ60,2)","v":1.192757212350337E-9},{"$f":"bint(AH60,AI60,AJ60,3)","v":0.99999999967544884}]
[35,40,0.5,{"$f":"bint(A61,B61,C61,0)","v":5.984547897241998E-7},{"$f":"bint(A61,B61,C61,1)","v":0.99999990714878118},{"$f":"bint(A61,B61,C61,2)","v":6.913060133228995E-7},{"$f":"bint(A61,B61,C61,3)","v":0.99999981429755758},{"$f":"binU(A61,B61,C61,3)","v":0.99999981429755758},null,11,13,0.5,{"$f":"binomt(J61,K61,L61,0)","v":9.5214843749999983E-3},{"$f":"binomt(J61,K61,L61,1)","v":0.998291015625},{"$f":"binomt(J61,K61,L61,2)","v":1.123046875E-2},null,null,48,50,0.5,{"$f":"bint(R61,S61,T61,0)","v":1.0880185641326512E-12},{"$f":"bint(R61,S61,T61,1)","v":0.99999999999996503},{"$f":"bint(R61,S61,T61,2)","v":1.133315663537358E-12},{"$f":"bint(R61,S61,T61,3)","v":0.99999999999996503},null,48,100,0.5,{"$f":"bint(Z61,AA61,AB61,0)","v":7.3527010406712223E-2},{"$f":"bint(Z61,AA61,AB61,1)","v":0.38217671720135971},{"$f":"bint(Z61,AA61,AB61,2)","v":0.69135029320542085},{"$f":"bint(Z61,AA61,AB61,3)","v":0.38270058641077359},null,48,100,0.2,{"$f":"bint(AH61,AI61,AJ61,0)","v":2.3964346468926995E-10},{"$f":"bint(AH61,AI61,AJ61,1)","v":0.99999999991509225},{"$f":"bint(AH61,AI61,AJ61,2)","v":3.2461484970241647E-10},{"$f":"bint(AH61,AI61,AJ61,3)","v":0.99999999991509225}]
[36,40,0.5,{"$f":"bint(A62,B62,C62,0)","v":8.3118720795027607E-8},{"$f":"bint(A62,B62,C62,1)","v":0.99999999026750197},{"$f":"bint(A62,B62,C62,2)","v":9.2851223598699699E-8},{"$f":"bint(A62,B62,C62,3)","v":0.99999999026750197},{"$f":"binU(A62,B62,C62,3)","v":0.99999998053499917},null,12,13,0.5,{"$f":"binomt(J62,K62,L62,0)","v":1.5869140625000009E-3},{"$f":"binomt(J62,K62,L62,1)","v":0.9998779296875},{"$f":"binomt(J62,K62,L62,2)","v":1.708984375E-3},null,null,49,50,0.5,{"$f":"bint(R62,S62,T62,0)","v":4.4408920985006716E-14},{"$f":"bint(R62,S62,T62,1)","v":1.0000000000000093},{"$f":"bint(R62,S62,T62,2)","v":4.5297099404706841E-14},{"$f":"bint(R62,S62,T62,3)","v":1.0000000000000093},null,49,100,0.5,{"$f":"bint(Z62,AA62,AB62,0)","v":7.8028664105082871E-2},{"$f":"bint(Z62,AA62,AB62,1)","v":0.46020538130644256},{"$f":"bint(Z62,AA62,AB62,2)","v":0.61782328279870857},{"$f":"bint(Z62,AA62,AB62,3)","v":0.23564656559734914},null,49,100,0.2,{"$f":"bint(AH62,AI62,AJ62,0)","v":6.3578878386949339E-11},{"$f":"bint(AH62,AI62,AJ62,1)","v":0.99999999997867117},{"$f":"bint(AH62,AI62,AJ62,2)","v":8.4971385013146559E-11},{"$f":"bint(AH62,AI62,AJ62,3)","v":0.99999999997867117}]
[37,40,0.5,{"$f":"bint(A63,B63,C63,0)","v":8.9858076535165211E-9},{"$f":"bint(A63,B63,C63,1)","v":0.99999999925330962},{"$f":"bint(A63,B63,C63,2)","v":9.7325028036720935E-9},{"$f":"bint(A63,B63,C63,3)","v":0.99999999925330962},{"$f":"binU(A63,B63,C63,3)","v":0.99999999850661447},null,13,13,0.5,{"$f":"binomt(J63,K63,L63,0)","v":1.2207031250000008E-4},{"$f":"binomt(J63,K63,L63,1)","v":1},{"$f":"binomt(J63,K63,L63,2)","v":1.220703125E-4},null,null,50,50,0.5,{"$f":"bint(R63,S63,T63,0)","v":8.8817841970012444E-16},{"$f":"bint(R63,S63,T63,1)","v":1.0000000000000102},{"$f":"bint(R63,S63,T63,2)","v":8.8817841970012444E-16},{"$f":"bint(R63,S63,T63,3)","v":1.0000000000000102},null,50,100,0.5,{"$f":"bint(Z63,AA63,AB63,0)","v":7.9589237387183404E-2},{"$f":"bint(Z63,AA63,AB63,1)","v":0.53979461869362599},{"$f":"bint(Z63,AA63,AB63,2)","v":0.53979461869362577},{"$f":"bint(Z63,AA63,AB63,3)","v":7.9589237387183404E-2},null,50,100,0.2,{"$f":"bint(AH63,AI63,AJ63,0)","v":1.6212613988671966E-11},{"$f":"bint(AH63,AI63,AJ63,1)","v":0.99999999999488376},{"$f":"bint(AH63,AI63,AJ63,2)","v":2.139250662619722E-11},{"$f":"bint(AH63,AI63,AJ63,3)","v":0.99999999999488376}]
[38,40,0.5,{"$f":"bint(A64,B64,C64,0)","v":7.0940586738288165E-10},{"$f":"bint(A64,B64,C64,1)","v":0.99999999996271549},{"$f":"bint(A64,B64,C64,2)","v":7.466951501555716E-10},{"$f":"bint(A64,B64,C64,3)","v":0.99999999996271549},{"$f":"binU(A64,B64,C64,3)","v":0.99999999992542621},null,null,null,null,null,null,null,null,null,null,null,null,null,null,null,null,null,51,100,0.5,{"$f":"bint(Z64,AA64,AB64,0)","v":7.8028664105082871E-2},{"$f":"bint(Z64,AA64,AB64,1)","v":0.61782328279870891},{"$f":"bint(Z64,AA64,AB64,2)","v":0.46020538130644228},{"$f":"bint(Z64,AA64,AB64,3)","v":0.23564656559734914},null,51,100,0.2,{"$f":"bint(AH64,AI64,AJ64,0)","v":3.9736798991843184E-12},{"$f":"bint(AH64,AI64,AJ64,1)","v":0.99999999999885747},{"$f":"bint(AH64,AI64,AJ64,2)","v":5.1798926375252572E-12},{"$f":"bint(AH64,AI64,AJ64,3)","v":0.99999999999885747}]
[39,40,0.5,{"$f":"bint(A65,B65,C65,0)","v":3.6379788070917046E-11},{"$f":"bint(A65,B65,C65,1)","v":0.99999999999909528},{"$f":"bint(A65,B65,C65,2)","v":3.7289282772689974E-11},{"$f":"bint(A65,B65,C65,3)","v":0.99999999999909528},{"$f":"binU(A65,B65,C65,3)","v":0.99999999999818578},null,null,null,null,null,null,null,null,null,null,null,null,null,null,null,null,null,52,100,0.5,{"$f":"bint(Z65,AA65,AB65,0)","v":7.3527010406712223E-2},{"$f":"bint(Z65,AA65,AB65,1)","v":0.69135029320542118},{"$f":"bint(Z65,AA65,AB65,2)","v":0.38217671720135948},{"$f":"bint(Z65,AA65,AB65,3)","v":0.38270058641077359},null,52,100,0.2,{"$f":"bint(AH65,AI65,AJ65,0)","v":9.3610728394246338E-13},{"$f":"bint(AH65,AI65,AJ65,1)","v":0.99999999999979361},{"$f":"bint(AH65,AI65,AJ65,2)","v":1.2062127383409383E-12},{"$f":"bint(AH65,AI65,AJ65,3)","v":0.99999999999979361}]
[40,40,0.5,{"$f":"bint(A66,B66,C66,0)","v":9.0949470177292824E-13},{"$f":"bint(A66,B66,C66,1)","v":1.0000000000000049},{"$f":"bint(A66,B66,C66,2)","v":9.0949470177292824E-13},{"$f":"bint(A66,B66,C66,3)","v":1.0000000000000049},{"$f":"binU(A66,B66,C66,3)","v":1},null,null,null,null,null,null,null,null,null,null,null,null,null,null,null,null,null,53,100,0.5,{"$f":"bint(Z66,AA66,AB66,0)","v":6.659049999098389E-2},{"$f":"bint(Z66,AA66,AB66,1)","v":0.75794079319640506},{"$f":"bint(Z66,AA66,AB66,2)","v":0.30864970679464726},{"$f":"bint(Z66,AA66,AB66,3)","v":0.51588158639274129},null,53,100,0.2,{"$f":"bint(AH66,AI66,AJ66,0)","v":2.1194881900583905E-13},{"$f":"bint(AH66,AI66,AJ66,1)","v":1.0000000000000056},{"$f":"bint(AH66,AI66,AJ66,2)","v":2.7010545439847525E-13},{"$f":"bint(AH66,AI66,AJ66,3)","v":1.0000000000000056}]
[null,null,null,null,null,null,null,null,null,null,null,null,null,null,null,null,null,null,null,null,null,null,null,null,null,54,100,0.5,{"$f":"bint(Z67,AA67,AB67,0)","v":5.7958398140301348E-2},{"$f":"bint(Z67,AA67,AB67,1)","v":0.81589919133670641},{"$f":"bint(Z67,AA67,AB67,2)","v":0.2420592068036633},{"$f":"bint(Z67,AA67,AB67,3)","v":0.63179838267334398},null,54,100,0.2,{"$f":"bint(AH67,AI67,AJ67,0)","v":4.6118493024418946E-14},{"$f":"bint(AH67,AI67,AJ67,1)","v":1.0000000000000517},{"$f":"bint(AH67,AI67,AJ67,2)","v":5.8156635392636187E-14},{"$f":"bint(AH67,AI67,AJ67,3)","v":1.0000000000000517}]
[null,null,null,{"$f":"1-BINOMDIST(51,100,0.4,1)","v":1.0005143199993016E-2},null,null,null,null,null,null,null,null,null,null,null,null,null,null,null,null,null,null,null,null,null,55,100,0.5,{"$f":"bint(Z68,AA68,AB68,0)","v":4.8474296626434057E-2},{"$f":"bint(Z68,AA68,AB68,1)","v":0.86437348796314051},{"$f":"bint(Z68,AA68,AB68,2)","v":0.18410080866336195},{"$f":"bint(Z68,AA68,AB68,3)","v":0.72874697592621218},null,55,100,0.2,{"$f":"bint(AH68,AI68,AJ68,0)","v":9.6429576323784437E-15},{"$f":"bint(AH68,AI68,AJ68,1)","v":1.0000000000000613},{"$f":"bint(AH68,AI68,AJ68,2)","v":1.2038142368217222E-14},{"$f":"bint(AH68,AI68,AJ68,3)","v":1.0000000000000613}]
[null,null,null,{"$f":"POISSON(0,20000/7000,1)","v":5.7432619267617349E-2},null,null,null,null,null,null,null,null,null,null,null,null,null,null,null,null,null,null,null,null,null,56,100,0.5,{"$f":"bint(Z69,AA69,AB69,0)","v":3.8952559789099124E-2},{"$f":"bint(Z69,AA69,AB69,1)","v":0.90332604775223968},{"$f":"bint(Z69,AA69,AB69,2)","v":0.13562651203692788},{"$f":"bint(Z69,AA69,AB69,3)","v":0.8066520955044113},null,56,100,0.2,{"$f":"bint(AH69,AI69,AJ69,0)","v":1.9372013100760424E-15},{"$f":"bint(AH69,AI69,AJ69,1)","v":1.0000000000000633},{"$f":"bint(AH69,AI69,AJ69,2)","v":2.39518473583878E-15},{"$f":"bint(AH69,AI69,AJ69,3)","v":1.0000000000000633}]
[null,null,null,{"$f":"BINOMDIST(0,20000,1/7000,1)","v":5.7420898404670795E-2},null,null,null,null,null,null,null,null,null,null,null,null,null,null,null,null,null,null,null,null,null,57,100,0.5,{"$f":"bint(Z70,AA70,AB70,0)","v":3.0068642644216631E-2},{"$f":"bint(Z70,AA70,AB70,1)","v":0.93339469039645628},{"$f":"bint(Z70,AA70,AB70,2)","v":9.6673952247828779E-2},{"$f":"bint(Z70,AA70,AB70,3)","v":0.86678938079284418},null,57,100,0.2,{"$f":"bint(AH70,AI70,AJ70,0)","v":3.7384586685678111E-16},{"$f":"bint(AH70,AI70,AJ70,1)","v":1.0000000000000637},{"$f":"bint(AH70,AI70,AJ70,2)","v":4.5798342576273726E-16},{"$f":"bint(AH70,AI70,AJ70,3)","v":1.0000000000000637}]
[null,null,null,null,null,null,null,null,null,null,null,null,null,null,null,null,null,null,null,null,null,null,null,null,null,58,100,0.5,{"$f":"bint(Z71,AA71,AB71,0)","v":2.229226954657473E-2},{"$f":"bint(Z71,AA71,AB71,1)","v":0.95568695994303099},{"$f":"bint(Z71,AA71,AB71,2)","v":6.6605309603612162E-2},{"$f":"bint(Z71,AA71,AB71,3)","v":0.91137391988599348},null,58,100,0.2,{"$f":"bint(AH71,AI71,AJ71,0)","v":6.9290397736387658E-17},{"$f":"bint(AH71,AI71,AJ71,1)","v":1.0000000000000637},{"$f":"bint(AH71,AI71,AJ71,2)","v":8.413755890595618E-17},{"$f":"bint(AH71,AI71,AJ71,3)","v":1.0000000000000637}]
[null,null,null,null,null,null,null,null,null,null,null,null,null,null,null,null,null,null,null,null,null,null,null,null,null,59,100,0.5,{"$f":"bint(Z72,AA72,AB72,0)","v":1.5869073236544642E-2},{"$f":"bint(Z72,AA72,AB72,1)","v":0.97155603317957562},{"$f":"bint(Z72,AA72,AB72,2)","v":4.4313040057037428E-2},{"$f":"bint(Z72,AA72,AB72,3)","v":0.94311206635908307},null,59,100,0.2,{"$f":"bint(AH72,AI72,AJ72,0)","v":1.2331341970034898E-17},{"$f":"bint(AH72,AI72,AJ72,1)","v":1.0000000000000637},{"$f":"bint(AH72,AI72,AJ72,2)","v":1.4847161169568559E-17},{"$f":"bint(AH72,AI72,AJ72,3)","v":1.0000000000000637}]
[null,null,null,null,null,null,null,null,null,null,null,null,null,null,null,null,null,null,null,null,null,null,null,null,null,60,100,0.5,{"$f":"bint(Z73,AA73,AB73,0)","v":1.0843866711638844E-2},{"$f":"bint(Z73,AA73,AB73,1)","v":0.98239989989121446},{"$f":"bint(Z73,AA73,AB73,2)","v":2.8443966820492796E-2},{"$f":"bint(Z73,AA73,AB73,3)","v":0.96479979978236052},null,60,100,0.2,{"$f":"bint(AH73,AI73,AJ73,0)","v":2.1066042532142953E-18},{"$f":"bint(AH73,AI73,AJ73,1)","v":1.0000000000000637},{"$f":"bint(AH73,AI73,AJ73,2)","v":2.5158191995336586E-18},{"$f":"bint(AH73,AI73,AJ73,3)","v":1.0000000000000637}]
[null,null,null,null,null,null,null,null,null,null,null,null,null,null,null,null,null,null,null,null,null,null,null,null,null,61,100,0.5,{"$f":"bint(Z74,AA74,AB74,0)","v":7.1107322699271508E-3},{"$f":"bint(Z74,AA74,AB74,1)","v":0.98951063216114166},{"$f":"bint(Z74,AA74,AB74,2)","v":1.7600100108853951E-2},{"$f":"bint(Z74,AA74,AB74,3)","v":0.97902126432221481},null,61,100,0.2,{"$f":"bint(AH74,AI74,AJ74,0)","v":3.4534495954332779E-19},{"$f":"bint(AH74,AI74,AJ74,1)","v":1.0000000000000637},{"$f":"bint(AH74,AI74,AJ74,2)","v":4.0921494631936312E-19},{"$f":"bint(AH74,AI74,AJ74,3)","v":1.0000000000000637}]
[null,null,null,null,null,null,null,null,null,null,null,null,null,null,null,null,null,null,null,null,null,null,null,null,null,62,100,0.5,{"$f":"bint(Z75,AA75,AB75,0)","v":4.4728799762445452E-3},{"$f":"bint(Z75,AA75,AB75,1)","v":0.99398351213738623},{"$f":"bint(Z75,AA75,AB75,2)","v":1.0489367838926804E-2},{"$f":"bint(Z75,AA75,AB75,3)","v":0.98796702427470395},null,62,100,0.2,{"$f":"bint(AH75,AI75,AJ75,0)","v":5.4308279928185937E-20},{"$f":"bint(AH75,AI75,AJ75,1)","v":1.0000000000000637},{"$f":"bint(AH75,AI75,AJ75,2)","v":6.386998677603525E-20},{"$f":"bint(AH75,AI75,AJ75,3)","v":1.0000000000000637}]
[null,null,null,null,null,null,null,null,null,null,null,null,null,null,null,null,null,null,null,null,null,null,null,null,null,63,100,0.5,{"$f":"bint(Z76,AA76,AB76,0)","v":2.6979276047189296E-3},{"$f":"bint(Z76,AA76,AB76,1)","v":0.9966814397421051},{"$f":"bint(Z76,AA76,AB76,2)","v":6.0164878626822521E-3},{"$f":"bint(Z76,AA76,AB76,3)","v":0.99336287948414159},null,63,100,0.2,{"$f":"bint(AH76,AI76,AJ76,0)","v":8.1893437986946672E-21},{"$f":"bint(AH76,AI76,AJ76,1)","v":1.0000000000000637},{"$f":"bint(AH76,AI76,AJ76,2)","v":9.5617068478493327E-21},{"$f":"bint(AH76,AI76,AJ76,3)","v":1.0000000000000637}]
[null,null,null,null,null,null,null,null,null,null,null,null,null,null,null,null,null,null,null,null,null,null,null,null,null,64,100,0.5,{"$f":"bint(Z77,AA77,AB77,0)","v":1.55973939647811E-3},{"$f":"bint(Z77,AA77,AB77,1)","v":0.99824117913858323},{"$f":"bint(Z77,AA77,AB77,2)","v":3.3185602579633242E-3},{"$f":"bint(Z77,AA77,AB77,3)","v":0.99648235827709786},null,64,100,0.2,{"$f":"bint(AH77,AI77,AJ77,0)","v":1.1836160959050725E-21},{"$f":"bint(AH77,AI77,AJ77,1)","v":1.0000000000000637},{"$f":"bint(AH77,AI77,AJ77,2)","v":1.3723630491546661E-21},{"$f":"bint(AH77,AI77,AJ77,3)","v":1.0000000000000637}]
[null,null,null,null,null,null,null,null,null,null,null,null,null,null,null,null,null,null,null,null,null,null,null,null,null,65,100,0.5,{"$f":"bint(Z78,AA78,AB78,0)","v":8.6385566574171345E-4},{"$f":"bint(Z78,AA78,AB78,1)","v":0.999105034804325},{"$f":"bint(Z78,AA78,AB78,2)","v":1.7588208614852145E-3},{"$f":"bint(Z78,AA78,AB78,3)","v":0.9982100696085815},null,65,100,0.2,{"$f":"bint(AH78,AI78,AJ78,0)","v":1.6388530558685385E-22},{"$f":"bint(AH78,AI78,AJ78,1)","v":1.0000000000000637},{"$f":"bint(AH78,AI78,AJ78,2)","v":1.8874695324959373E-22},{"$f":"bint(AH78,AI78,AJ78,3)","v":1.0000000000000637}]
[null,null,null,null,null,null,null,null,null,null,null,null,null,null,null,null,null,null,null,null,null,null,null,null,null,66,100,0.5,{"$f":"bint(Z79,AA79,AB79,0)","v":4.5810527728727544E-4},{"$f":"bint(Z79,AA79,AB79,1)","v":0.99956314008161229},{"$f":"bint(Z79,AA79,AB79,2)","v":8.9496519574350101E-4},{"$f":"bint(Z79,AA79,AB79,3)","v":0.99912628016315597},null,66,100,0.2,{"$f":"bint(AH79,AI79,AJ79,0)","v":2.1727218543711677E-23},{"$f":"bint(AH79,AI79,AJ79,1)","v":1.0000000000000637},{"$f":"bint(AH79,AI79,AJ79,2)","v":2.4861647662739915E-23},{"$f":"bint(AH79,AI79,AJ79,3)","v":1.0000000000000637}]
[null,null,null,null,null,null,null,null,null,null,null,null,null,null,null,null,null,null,null,null,null,null,null,null,null,67,100,0.5,{"$f":"bint(Z80,AA80,AB80,0)","v":2.3247133474280031E-4},{"$f":"bint(Z80,AA80,AB80,1)","v":0.99979561141635509},{"$f":"bint(Z80,AA80,AB80,2)","v":4.3685991845622579E-4},{"$f":"bint(Z80,AA80,AB80,3)","v":0.99959122283264157},null,67,100,0.2,{"$f":"bint(AH80,AI80,AJ80,0)","v":2.7564381734560334E-24},{"$f":"bint(AH80,AI80,AJ80,1)","v":1.0000000000000637},{"$f":"bint(AH80,AI80,AJ80,2)","v":3.1344291190282412E-24},{"$f":"bint(AH80,AI80,AJ80,3)","v":1.0000000000000637}]
[null,null,null,null,null,null,null,null,null,null,null,null,null,null,null,null,null,null,null,null,null,null,null,null,null,68,100,0.5,{"$f":"bint(Z81,AA81,AB81,0)","v":1.1281697127224095E-4},{"$f":"bint(Z81,AA81,AB81,1)","v":0.99990842838762728},{"$f":"bint(Z81,AA81,AB81,2)","v":2.0438858371342531E-4},{"$f":"bint(Z81,AA81,AB81,3)","v":0.99981685677518606},null,68,100,0.2,{"$f":"bint(AH81,AI81,AJ81,0)","v":3.3442080780900285E-25},{"$f":"bint(AH81,AI81,AJ81,1)","v":1.0000000000000637},{"$f":"bint(AH81,AI81,AJ81,2)","v":3.77990945572208E-25},{"$f":"bint(AH81,AI81,AJ81,3)","v":1.0000000000000637}]
[null,null,null,null,null,null,null,null,null,null,null,null,null,null,null,null,null,null,null,null,null,null,null,null,null,69,100,0.5,{"$f":"bint(Z82,AA82,AB82,0)","v":5.2320914213212505E-5},{"$f":"bint(Z82,AA82,AB82,1)","v":0.99996074930184053},{"$f":"bint(Z82,AA82,AB82,2)","v":9.1571612441184404E-5},{"$f":"bint(Z82,AA82,AB82,3)","v":0.99992149860361246},null,69,100,0.2,{"$f":"bint(AH82,AI82,AJ82,0)","v":3.8773426992347642E-26},{"$f":"bint(AH82,AI82,AJ82,1)","v":1.0000000000000637},{"$f":"bint(AH82,AI82,AJ82,2)","v":4.3570137763205215E-26},{"$f":"bint(AH82,AI82,AJ82,3)","v":1.0000000000000637}]
[null,null,null,null,null,null,null,null,null,null,null,null,null,null,null,null,null,null,null,null,null,null,null,null,null,70,100,0.5,{"$f":"bint(Z83,AA83,AB83,0)","v":2.3170690580137207E-5},{"$f":"bint(Z83,AA83,AB83,1)","v":0.99998391999242064},{"$f":"bint(Z83,AA83,AB83,2)","v":3.9250698227971892E-5},{"$f":"bint(Z83,AA83,AB83,3)","v":0.99996783998477279},null,70,100,0.2,{"$f":"bint(AH83,AI83,AJ83,0)","v":4.2927722741527724E-27},{"$f":"bint(AH83,AI83,AJ83,1)","v":1.0000000000000637},{"$f":"bint(AH83,AI83,AJ83,2)","v":4.7967107708575787E-27},{"$f":"bint(AH83,AI83,AJ83,3)","v":1.0000000000000637}]
[null,null,null,null,null,null,null,null,null,null,null,null,null,null,null,null,null,null,null,null,null,null,null,null,null,71,100,0.5,{"$f":"bint(Z84,AA84,AB84,0)","v":9.7904326394946603E-6},{"$f":"bint(Z84,AA84,AB84,1)","v":0.99999371042506013},{"$f":"bint(Z84,AA84,AB84,2)","v":1.6080007647834679E-5},{"$f":"bint(Z84,AA84,AB84,3)","v":0.99998742085005177},null,71,100,0.2,{"$f":"bint(AH84,AI84,AJ84,0)","v":4.5346185994571833E-28},{"$f":"bint(AH84,AI84,AJ84,1)","v":1.0000000000000637},{"$f":"bint(AH84,AI84,AJ84,2)","v":5.039384967048057E-28},{"$f":"bint(AH84,AI84,AJ84,3)","v":1.0000000000000637}]
[null,null,null,null,null,null,null,null,null,null,null,null,null,null,null,null,null,null,null,null,null,null,null,null,null,72,100,0.5,{"$f":"bint(Z85,AA85,AB85,0)","v":3.9433687020186809E-6},{"$f":"bint(Z85,AA85,AB85,1)","v":0.99999765379376215},{"$f":"bint(Z85,AA85,AB85,2)","v":6.2895750083400167E-6},{"$f":"bint(Z85,AA85,AB85,3)","v":0.99999530758745581},null,72,100,0.2,{"$f":"bint(AH85,AI85,AJ85,0)","v":4.5661090063979044E-29},{"$f":"bint(AH85,AI85,AJ85,1)","v":1.0000000000000637},{"$f":"bint(AH85,AI85,AJ85,2)","v":5.0476636759087279E-29},{"$f":"bint(AH85,AI85,AJ85,3)","v":1.0000000000000637}]
[null,null,null,null,null,null,null,null,null,null,null,null,null,null,null,null,null,null,null,null,null,null,null,null,null,73,100,0.5,{"$f":"bint(Z86,AA86,AB86,0)","v":1.5125249815962072E-6},{"$f":"bint(Z86,AA86,AB86,1)","v":0.99999916631874375},{"$f":"bint(Z86,AA86,AB86,2)","v":2.3462063063213362E-6},{"$f":"bint(Z86,AA86,AB86,3)","v":0.99999833263741889},null,73,100,0.2,{"$f":"bint(AH86,AI86,AJ86,0)","v":4.3784606910664855E-30},{"$f":"bint(AH86,AI86,AJ86,1)","v":1.0000000000000637},{"$f":"bint(AH86,AI86,AJ86,2)","v":4.8155466951082379E-30},{"$f":"bint(AH86,AI86,AJ86,3)","v":1.0000000000000637}]
[null,null,null,null,null,null,null,null,null,null,null,null,null,null,null,null,null,null,null,null,null,null,null,null,null,74,100,0.5,{"$f":"bint(Z87,AA87,AB87,0)","v":5.5186722301483458E-7},{"$f":"bint(Z87,AA87,AB87,1)","v":0.99999971818596678},{"$f":"bint(Z87,AA87,AB87,2)","v":8.3368132472512942E-7},{"$f":"bint(Z87,AA87,AB87,3)","v":0.99999943637186495},null,74,100,0.2,{"$f":"bint(AH87,AI87,AJ87,0)","v":3.9938661709051844E-31},{"$f":"bint(AH87,AI87,AJ87,1)","v":1.0000000000000637},{"$f":"bint(AH87,AI87,AJ87,2)","v":4.3708600404175242E-31},{"$f":"bint(AH87,AI87,AJ87,3)","v":1.0000000000000637}]
[null,null,null,null,null,null,null,null,null,null,null,null,null,null,null,null,null,null,null,null,null,null,null,null,null,75,100,0.5,{"$f":"bint(Z88,AA88,AB88,0)","v":1.9131397064514162E-7},{"$f":"bint(Z88,AA88,AB88,1)","v":0.99999990949993744},{"$f":"bint(Z88,AA88,AB88,2)","v":2.8181410171029478E-7},{"$f":"bint(Z88,AA88,AB88,3)","v":0.99999981899980628},null,75,100,0.2,{"$f":"bint(AH88,AI88,AJ88,0)","v":3.4613506814511651E-32},{"$f":"bint(AH88,AI88,AJ88,1)","v":1.0000000000000637},{"$f":"bint(AH88,AI88,AJ88,2)","v":3.7699386951234033E-32},{"$f":"bint(AH88,AI88,AJ88,3)","v":1.0000000000000637}]
[null,null,null,null,null,null,null,null,null,null,null,null,null,null,null,null,null,null,null,null,null,null,null,null,null,76,100,0.5,{"$f":"bint(Z89,AA89,AB89,0)","v":6.2932227185900981E-8},{"$f":"bint(Z89,AA89,AB89,1)","v":0.99999997243216465},{"$f":"bint(Z89,AA89,AB89,2)","v":9.05001310651532E-8},{"$f":"bint(Z89,AA89,AB89,3)","v":0.99999997243216465},null,76,100,0.2,{"$f":"bint(AH89,AI89,AJ89,0)","v":2.8465054946143745E-33},{"$f":"bint(AH89,AI89,AJ89,1)","v":1.0000000000000637},{"$f":"bint(AH89,AI89,AJ89,2)","v":3.0858801367223794E-33},{"$f":"bint(AH89,AI89,AJ89,3)","v":1.0000000000000637}]
[null,null,null,null,null,null,null,null,null,null,null,null,null,null,null,null,null,null,null,null,null,null,null,null,null,77,100,0.5,{"$f":"bint(Z90,AA90,AB90,0)","v":1.9615239642358666E-8},{"$f":"bint(Z90,AA90,AB90,1)","v":0.99999999204740431},{"$f":"bint(Z90,AA90,AB90,2)","v":2.7567903879252196E-8},{"$f":"bint(Z90,AA90,AB90,3)","v":0.99999999204740431},null,77,100,0.2,{"$f":"bint(AH90,AI90,AJ90,0)","v":2.2180562295696961E-34},{"$f":"bint(AH90,AI90,AJ90,1)","v":1.0000000000000637},{"$f":"bint(AH90,AI90,AJ90,2)","v":2.3937464210800606E-34},{"$f":"bint(AH90,AI90,AJ90,3)","v":1.0000000000000637}]
[null,null,null,null,null,null,null,null,null,null,null,null,null,null,null,null,null,null,null,null,null,null,null,null,null,78,100,0.5,{"$f":"bint(Z91,AA91,AB91,0)","v":5.783980920182606E-9},{"$f":"bint(Z91,AA91,AB91,1)","v":0.99999999783138527},{"$f":"bint(Z91,AA91,AB91,2)","v":7.9526642368935381E-9},{"$f":"bint(Z91,AA91,AB91,3)","v":0.99999999783138527},null,78,100,0.2,{"$f":"bint(AH91,AI91,AJ91,0)","v":1.6351055538494277E-35},{"$f":"bint(AH91,AI91,AJ91,1)","v":1.0000000000000637},{"$f":"bint(AH91,AI91,AJ91,2)","v":1.7569019151036479E-35},{"$f":"bint(AH91,AI91,AJ91,3)","v":1.0000000000000637}]
[null,null,null,null,null,null,null,null,null,null,null,null,null,null,null,null,null,null,null,null,null,null,null,null,null,79,100,0.5,{"$f":"bint(Z92,AA92,AB92,0)","v":1.6107288638483025E-9},{"$f":"bint(Z92,AA92,AB92,1)","v":0.99999999944211415},{"$f":"bint(Z92,AA92,AB92,2)","v":2.1686833167109292E-9},{"$f":"bint(Z92,AA92,AB92,3)","v":0.99999999944211415},null,79,100,0.2,{"$f":"bint(AH92,AI92,AJ92,0)","v":1.1383646260976816E-36},{"$f":"bint(AH92,AI92,AJ92,1)","v":1.0000000000000637},{"$f":"bint(AH92,AI92,AJ92,2)","v":1.2179636125422005E-36},{"$f":"bint(AH92,AI92,AJ92,3)","v":1.0000000000000637}]
[null,null,null,null,null,null,null,null,null,null,null,null,null,null,null,null,null,null,null,null,null,null,null,null,null,80,100,0.5,{"$f":"bint(Z93,AA93,AB93,0)","v":4.228163267601794E-10},{"$f":"bint(Z93,AA93,AB93,1)","v":0.99999999986493049},{"$f":"bint(Z93,AA93,AB93,2)","v":5.5795445286262704E-10},{"$f":"bint(Z93,AA93,AB93,3)","v":0.99999999986493049},null,80,100,0.2,{"$f":"bint(AH93,AI93,AJ93,0)","v":7.4705178587660867E-38},{"$f":"bint(AH93,AI93,AJ93,1)","v":1.0000000000000637},{"$f":"bint(AH93,AI93,AJ93,2)","v":7.9598986444518976E-38},{"$f":"bint(AH93,AI93,AJ93,3)","v":1.0000000000000637}]
[null,null,null,null,null,null,null,null,null,null,null,null,null,null,null,null,null,null,null,null,null,null,null,null,null,81,100,0.5,{"$f":"bint(Z94,AA94,AB94,0)","v":1.0439909302720644E-10},{"$f":"bint(Z94,AA94,AB94,1)","v":0.99999999996932953},{"$f":"bint(Z94,AA94,AB94,2)","v":1.3513812610244769E-10},{"$f":"bint(Z94,AA94,AB94,3)","v":0.99999999996932953},null,81,100,0.2,{"$f":"bint(AH94,AI94,AJ94,0)","v":4.6114307770162244E-39},{"$f":"bint(AH94,AI94,AJ94,1)","v":1.0000000000000637},{"$f":"bint(AH94,AI94,AJ94,2)","v":4.893807856858103E-39},{"$f":"bint(AH94,AI94,AJ94,3)","v":1.0000000000000637}]
[null,null,null,null,null,null,null,null,null,null,null,null,null,null,null,null,null,null,null,null,null,null,null,null,null,82,100,0.5,{"$f":"bint(Z95,AA95,AB95,0)","v":2.4190033750205824E-11},{"$f":"bint(Z95,AA95,AB95,1)","v":0.99999999999351952},{"$f":"bint(Z95,AA95,AB95,2)","v":3.0739033075241201E-11},{"$f":"bint(Z95,AA95,AB95,3)","v":0.99999999999351952},null,82,100,0.2,{"$f":"bint(AH95,AI95,AJ95,0)","v":2.6712556330275638E-40},{"$f":"bint(AH95,AI95,AJ95,1)","v":1.0000000000000637},{"$f":"bint(AH95,AI95,AJ95,2)","v":2.8237707984187817E-40},{"$f":"bint(AH95,AI95,AJ95,3)","v":1.0000000000000637}]
[null,null,null,null,null,null,null,null,null,null,null,null,null,null,null,null,null,null,null,null,null,null,null,null,null,83,100,0.5,{"$f":"bint(Z96,AA96,AB96,0)","v":5.2460314157072612E-12},{"$f":"bint(Z96,AA96,AB96,1)","v":0.99999999999876554},{"$f":"bint(Z96,AA96,AB96,2)","v":6.5489993250353863E-12},{"$f":"bint(Z96,AA96,AB96,3)","v":0.99999999999876554},null,83,100,0.2,{"$f":"bint(AH96,AI96,AJ96,0)","v":1.4482711263402585E-41},{"$f":"bint(AH96,AI96,AJ96,1)","v":1.0000000000000637},{"$f":"bint(AH96,AI96,AJ96,2)","v":1.5251516539121772E-41},{"$f":"bint(AH96,AI96,AJ96,3)","v":1.0000000000000637}]
[null,null,null,null,null,null,null,null,null,null,null,null,null,null,null,null,null,null,null,null,null,null,null,null,null,84,100,0.5,{"$f":"bint(Z97,AA97,AB97,0)","v":1.0616968341312498E-12},{"$f":"bint(Z97,AA97,AB97,1)","v":0.99999999999982725},{"$f":"bint(Z97,AA97,AB97,2)","v":1.3029679093281255E-12},{"$f":"bint(Z97,AA97,AB97,3)","v":0.99999999999982725},null,84,100,0.2,{"$f":"bint(AH97,AI97,AJ97,0)","v":7.3275622463646326E-43},{"$f":"bint(AH97,AI97,AJ97,1)","v":1.0000000000000637},{"$f":"bint(AH97,AI97,AJ97,2)","v":7.6880527571918727E-43},{"$f":"bint(AH97,AI97,AJ97,3)","v":1.0000000000000637}]
[null,null,null,null,null,null,null,null,null,null,null,null,null,null,null,null,null,null,null,null,null,null,null,null,null,85,100,0.5,{"$f":"bint(Z98,AA98,AB98,0)","v":1.9984881583647235E-13},{"$f":"bint(Z98,AA98,AB98,1)","v":1.0000000000000271},{"$f":"bint(Z98,AA98,AB98,2)","v":2.4127107519687576E-13},{"$f":"bint(Z98,AA98,AB98,3)","v":1.0000000000000271},null,85,100,0.2,{"$f":"bint(AH98,AI98,AJ98,0)","v":3.4482645865244777E-44},{"$f":"bint(AH98,AI98,AJ98,1)","v":1.0000000000000637},{"$f":"bint(AH98,AI98,AJ98,2)","v":3.6049051082724196E-44},{"$f":"bint(AH98,AI98,AJ98,3)","v":1.0000000000000637}]
[null,null,null,null,null,null,null,null,null,null,null,null,null,null,null,null,null,null,null,null,null,null,null,null,null,86,100,0.5,{"$f":"bint(Z99,AA99,AB99,0)","v":3.4857351599384928E-14},{"$f":"bint(Z99,AA99,AB99,1)","v":1.000000000000062},{"$f":"bint(Z99,AA99,AB99,2)","v":4.1422259360403429E-14},{"$f":"bint(Z99,AA99,AB99,3)","v":1.000000000000062},null,86,100,0.2,{"$f":"bint(AH99,AI99,AJ99,0)","v":1.5036037441240704E-45},{"$f":"bint(AH99,AI99,AJ99,1)","v":1.0000000000000637},{"$f":"bint(AH99,AI99,AJ99,2)","v":1.5664052174794231E-45},{"$f":"bint(AH99,AI99,AJ99,3)","v":1.0000000000000637}]
[null,null,null,null,null,null,null,null,null,null,null,null,null,null,null,null,null,null,null,null,null,null,null,null,null,87,100,0.5,{"$f":"bint(Z100,AA100,AB100,0)","v":5.6092289930045819E-15},{"$f":"bint(Z100,AA100,AB100,1)","v":1.0000000000000675},{"$f":"bint(Z100,AA100,AB100,2)","v":6.5649077610184873E-15},{"$f":"bint(Z100,AA100,AB100,3)","v":1.0000000000000675},null,87,100,0.2,{"$f":"bint(AH100,AI100,AJ100,0)","v":6.0489805798094473E-47},{"$f":"bint(AH100,AI100,AJ100,1)","v":1.0000000000000637},{"$f":"bint(AH100,AI100,AJ100,2)","v":6.2801473355352957E-47},{"$f":"bint(AH100,AI100,AJ100,3)","v":1.0000000000000637}]
[null,null,null,null,null,null,null,null,null,null,null,null,null,null,null,null,null,null,null,null,null,null,null,null,null,88,100,0.5,{"$f":"bint(Z101,AA101,AB101,0)","v":8.2863610123928313E-16},{"$f":"bint(Z101,AA101,AB101,1)","v":1.0000000000000684},{"$f":"bint(Z101,AA101,AB101,2)","v":9.5567876801390522E-16},{"$f":"bint(Z101,AA101,AB101,3)","v":1.0000000000000684},null,88,100,0.2,{"$f":"bint(AH101,AI101,AJ101,0)","v":2.2339985095886904E-48},{"$f":"bint(AH101,AI101,AJ101,1)","v":1.0000000000000637},{"$f":"bint(AH101,AI101,AJ101,2)","v":2.3116675572584953E-48},{"$f":"bint(AH101,AI101,AJ101,3)","v":1.0000000000000637}]
[null,null,null,null,null,null,null,null,null,null,null,null,null,null,null,null,null,null,null,null,null,null,null,null,null,89,100,0.5,{"$f":"bint(Z102,AA102,AB102,0)","v":1.117262158974314E-16},{"$f":"bint(Z102,AA102,AB102,1)","v":1.0000000000000686},{"$f":"bint(Z102,AA102,AB102,2)","v":1.2704266677462228E-16},{"$f":"bint(Z102,AA102,AB102,3)","v":1.0000000000000686},null,89,100,0.2,{"$f":"bint(AH102,AI102,AJ102,0)","v":7.530332054793362E-50},{"$f":"bint(AH102,AI102,AJ102,1)","v":1.0000000000000637},{"$f":"bint(AH102,AI102,AJ102,2)","v":7.7669047669804619E-50},{"$f":"bint(AH102,AI102,AJ102,3)","v":1.0000000000000637}]
[null,null,null,null,null,null,null,null,null,null,null,null,null,null,null,null,null,null,null,null,null,null,null,null,null,90,100,0.5,{"$f":"bint(Z103,AA103,AB103,0)","v":1.3655426387463962E-17},{"$f":"bint(Z103,AA103,AB103,1)","v":1.0000000000000686},{"$f":"bint(Z103,AA103,AB103,2)","v":1.5316450877190884E-17},{"$f":"bint(Z103,AA103,AB103,3)","v":1.0000000000000686},null,90,100,0.2,{"$f":"bint(AH103,AI103,AJ103,0)","v":2.3009347945201736E-51},{"$f":"bint(AH103,AI103,AJ103,1)","v":1.0000000000000637},{"$f":"bint(AH103,AI103,AJ103,2)","v":2.3657271218710078E-51},{"$f":"bint(AH103,AI103,AJ103,3)","v":1.0000000000000637}]
[null,null,null,null,null,null,null,null,null,null,null,null,null,null,null,null,null,null,null,null,null,null,null,null,null,91,100,0.5,{"$f":"bint(Z104,AA104,AB104,0)","v":1.5005963063147153E-18},{"$f":"bint(Z104,AA104,AB104,1)","v":1.0000000000000686},{"$f":"bint(Z104,AA104,AB104,2)","v":1.6610244897269233E-18},{"$f":"bint(Z104,AA104,AB104,3)","v":1.0000000000000686},null,91,100,0.2,{"$f":"bint(AH104,AI104,AJ104,0)","v":6.3212494354950681E-53},{"$f":"bint(AH104,AI104,AJ104,1)","v":1.0000000000000637},{"$f":"bint(AH104,AI104,AJ104,2)","v":6.4792327350834015E-53},{"$f":"bint(AH104,AI104,AJ104,3)","v":1.0000000000000637}]
[null,null,null,null,null,null,null,null,null,null,null,null,null,null,null,null,null,null,null,null,null,null,null,null,null,92,100,0.5,{"$f":"bint(Z105,AA105,AB105,0)","v":1.4679746474817743E-19},{"$f":"bint(Z105,AA105,AB105,1)","v":1.0000000000000686},{"$f":"bint(Z105,AA105,AB105,2)","v":1.604281834122081E-19},{"$f":"bint(Z105,AA105,AB105,3)","v":1.0000000000000686},null,92,100,0.2,{"$f":"bint(AH105,AI105,AJ105,0)","v":1.5459577423764817E-54},{"$f":"bint(AH105,AI105,AJ105,1)","v":1.0000000000000637},{"$f":"bint(AH105,AI105,AJ105,2)","v":1.5798329958833374E-54},{"$f":"bint(AH105,AI105,AJ105,3)","v":1.0000000000000637}]
[null,null,null,null,null,null,null,null,null,null,null,null,null,null,null,null,null,null,null,null,null,null,null,null,null,93,100,0.5,{"$f":"bint(Z106,AA106,AB106,0)","v":1.2627738903068823E-20},{"$f":"bint(Z106,AA106,AB106,1)","v":1.0000000000000686},{"$f":"bint(Z106,AA106,AB106,2)","v":1.3630718664030687E-20},{"$f":"bint(Z106,AA106,AB106,3)","v":1.0000000000000686},null,93,100,0.2,{"$f":"bint(AH106,AI106,AJ106,0)","v":3.324640306185987E-56},{"$f":"bint(AH106,AI106,AJ106,1)","v":1.0000000000000637},{"$f":"bint(AH106,AI106,AJ106,2)","v":3.3875253506855827E-56},{"$f":"bint(AH106,AI106,AJ106,3)","v":1.0000000000000637}]
[null,null,null,null,null,null,null,null,null,null,null,null,null,null,null,null,null,null,null,null,null,null,null,null,null,94,100,0.5,{"$f":"bint(Z107,AA107,AB107,0)","v":9.4036353533493514E-22},{"$f":"bint(Z107,AA107,AB107,1)","v":1.0000000000000686},{"$f":"bint(Z107,AA107,AB107,2)","v":1.0029797609618644E-21},{"$f":"bint(Z107,AA107,AB107,3)","v":1.0000000000000686},null,94,100,0.2,{"$f":"bint(AH107,AI107,AJ107,0)","v":6.1894899317294897E-58},{"$f":"bint(AH107,AI107,AJ107,1)","v":1.0000000000000637},{"$f":"bint(AH107,AI107,AJ107,2)","v":6.2885044499595689E-58},{"$f":"bint(AH107,AI107,AJ107,3)","v":1.0000000000000637}]
[null,null,null,null,null,null,null,null,null,null,null,null,null,null,null,null,null,null,null,null,null,null,null,null,null,95,100,0.5,{"$f":"bint(Z108,AA108,AB108,0)","v":5.9391381179047405E-23},{"$f":"bint(Z108,AA108,AB108,1)","v":1.0000000000000686},{"$f":"bint(Z108,AA108,AB108,2)","v":6.261622562692927E-23},{"$f":"bint(Z108,AA108,AB108,3)","v":1.0000000000000686},null,95,100,0.2,{"$f":"bint(AH108,AI108,AJ108,0)","v":9.772878839572308E-60},{"$f":"bint(AH108,AI108,AJ108,1)","v":1.0000000000000637},{"$f":"bint(AH108,AI108,AJ108,2)","v":9.9014518230079459E-60},{"$f":"bint(AH108,AI108,AJ108,3)","v":1.0000000000000637}]
[null,null,null,null,null,null,null,null,null,null,null,null,null,null,null,null,null,null,null,null,null,null,null,null,null,96,100,0.5,{"$f":"bint(Z109,AA109,AB109,0)","v":3.0933011030753505E-24},{"$f":"bint(Z109,AA109,AB109,1)","v":1.0000000000000686},{"$f":"bint(Z109,AA109,AB109,2)","v":3.2248444478818628E-24},{"$f":"bint(Z109,AA109,AB109,3)","v":1.0000000000000686},null,96,100,0.2,{"$f":"bint(AH109,AI109,AJ109,0)","v":1.272510265569319E-61},{"$f":"bint(AH109,AI109,AJ109,1)","v":1.0000000000000637},{"$f":"bint(AH109,AI109,AJ109,2)","v":1.2857298343563898E-61},{"$f":"bint(AH109,AI109,AJ109,3)","v":1.0000000000000637}]
[null,null,null,null,null,null,null,null,null,null,null,null,null,null,null,null,null,null,null,null,null,null,null,null,null,97,100,0.5,{"$f":"bint(Z110,AA110,AB110,0)","v":1.2755880837424082E-25},{"$f":"bint(Z110,AA110,AB110,1)","v":1.0000000000000686},{"$f":"bint(Z110,AA110,AB110,2)","v":1.3154334480651215E-25},{"$f":"bint(Z110,AA110,AB110,3)","v":1.0000000000000686},null,97,100,0.2,{"$f":"bint(AH110,AI110,AJ110,0)","v":1.3118662531641997E-63},{"$f":"bint(AH110,AI110,AJ110,1)","v":1.0000000000000637},{"$f":"bint(AH110,AI110,AJ110,2)","v":1.3219568787070767E-63},{"$f":"bint(AH110,AI110,AJ110,3)","v":1.0000000000000637}]
[null,null,null,null,null,null,null,null,null,null,null,null,null,null,null,null,null,null,null,null,null,null,null,null,null,98,100,0.5,{"$f":"bint(Z111,AA111,AB111,0)","v":3.9048614808440199E-27},{"$f":"bint(Z111,AA111,AB111,1)","v":1.0000000000000686},{"$f":"bint(Z111,AA111,AB111,2)","v":3.9845364322713407E-27},{"$f":"bint(Z111,AA111,AB111,3)","v":1.0000000000000686},null,98,100,0.2,{"$f":"bint(AH111,AI111,AJ111,0)","v":1.0039792753807675E-65},{"$f":"bint(AH111,AI111,AJ111,1)","v":1.0000000000000637},{"$f":"bint(AH111,AI111,AJ111,2)","v":1.0090625542876827E-65},{"$f":"bint(AH111,AI111,AJ111,3)","v":1.0000000000000637}]
[null,null,null,null,null,null,null,null,null,null,null,null,null,null,null,null,null,null,null,null,null,null,null,null,null,99,100,0.5,{"$f":"bint(Z112,AA112,AB112,0)","v":7.8886090522099544E-29},{"$f":"bint(Z112,AA112,AB112,1)","v":1.0000000000000686},{"$f":"bint(Z112,AA112,AB112,2)","v":7.9674951427320556E-29},{"$f":"bint(Z112,AA112,AB112,3)","v":1.0000000000000686},null,99,100,0.2,{"$f":"bint(AH112,AI112,AJ112,0)","v":5.0706024009128638E-68},{"$f":"bint(AH112,AI112,AJ112,1)","v":1.0000000000000637},{"$f":"bint(AH112,AI112,AJ112,2)","v":5.0832789069151464E-68},{"$f":"bint(AH112,AI112,AJ112,3)","v":1.0000000000000637}]
[null,null,null,null,null,null,null,null,null,null,null,null,null,null,null,null,null,null,null,null,null,null,null,null,null,100,100,0.5,{"$f":"bint(Z113,AA113,AB113,0)","v":7.8886090522101049E-31},{"$f":"bint(Z113,AA113,AB113,1)","v":1.0000000000000686},{"$f":"bint(Z113,AA113,AB113,2)","v":7.8886090522101049E-31},{"$f":"bint(Z113,AA113,AB113,3)","v":1.0000000000000686},null,100,100,0.2,{"$f":"bint(AH113,AI113,AJ113,0)","v":1.2676506002282355E-70},{"$f":"bint(AH113,AI113,AJ113,1)","v":1.0000000000000637},{"$f":"bint(AH113,AI113,AJ113,2)","v":1.2676506002282355E-70},{"$f":"bint(AH113,AI113,AJ113,3)","v":1.0000000000000637}]

{"sheet":"V.Test","index":2,"n_rows":31,"n_cols":8,"rows_kept":31,"cut":false,"hidden":false,"merged":[]}
["Data","x",null,"V-test (v:V). Data",null,null,"V-test (v:V). Result"]
[1,18,null,"v",30,null,"v",95]
[2,22,null,"sd",{"$f":"SQRT(E2)","v":5.4772255750516612},null,"sd",{"$f":"SQRT(H2)","v":9.7467943448089631}]
[3,25,null,"N",{"$f":"COUNT(B:B)","v":30},null,"N",25]
[4,12,null,"V",{"$f":"VARP(B:B)","v":47.045555555555552},null,"V",50]
[5,22,null,"SD",{"$f":"SQRT(E5)","v":6.8589762760601198},null,"SD",{"$f":"SQRT(H5)","v":7.0710678118654755}]
[6,31,null,"Significance level",0.05,null,"Significance level",0.05]
[7,32,null,"Y-value",{"$f":"E4*E5/E2","v":47.045555555555552},null,"Y-value",{"$f":"H4*H5/H2","v":13.157894736842104}]
[8,22,null,"Lower probability",{"$f":"_xlfn.CHISQ.DIST(E8,E4-1,1)","v":0.98158035399817856},null,"Lower probability",{"$f":"_xlfn.CHISQ.DIST(H8,H4-1,1)","v":3.655329692477801E-2}]
[9,25,null,"Lower critical value",{"$f":"_xlfn.CHISQ.INV.RT(E7,E4-1)","v":42.556967804292682},null,"Lower critical value",{"$f":"_xlfn.CHISQ.INV.RT(H7,H4-1)","v":36.415028501807313}]
[10,18,null,"Lower significance",{"$f":"IF(E9<E7,\"S. (H1)\", \"NS (H0)\")","v":"NS (H0)"},null,"Lower significance",{"$f":"IF(H9<H7,\"S. (H1)\", \"NS (H0)\")","v":"S. (H1)"}]
[11,20,null,"Upper probability",{"$f":"_xlfn.CHISQ.DIST.RT(E8,E4-1)","v":1.8419646001821419E-2},null,"Upper probability",{"$f":"_xlfn.CHISQ.DIST.RT(H8,H4-1)","v":0.96344670307522207}]
[12,30,null,"Upper critical value",{"$f":"_xlfn.CHISQ.INV(E7,E4-1)","v":17.70836618282458},null,"Upper critical value",{"$f":"_xlfn.CHISQ.INV(H7,H4-1)","v":13.848425027170213}]
[13,29,null,"Upper significance",{"$f":"IF(E12<E7,\"S. (H1)\", \"NS (H0)\")","v":"S. (H1)"},null,"Upper significance",{"$f":"IF(H12<H7,\"S. (H1)\", \"NS (H0)\")","v":"NS (H0)"}]
[14,27,null,"Lower 2-tailed critical v.",{"$f":"_xlfn.CHISQ.INV.RT(E7/2,E4-1)","v":45.722285804174533},null,"Lower 2-tailed critical v.",{"$f":"_xlfn.CHISQ.INV.RT(H7/2,H4-1)","v":39.364077026603915}]
[15,25,null,"Upper 2-tailed critical v.",{"$f":"_xlfn.CHISQ.INV(E7/2,E4-1)","v":16.047071695364885},null,"Upper 2-tailed critical v.",{"$f":"_xlfn.CHISQ.INV(H7/2,H4-1)","v":12.401150217444433}]
[16,11,null,"Two-tailed probability",{"$f":"MIN(E9,E12)*2","v":3.6839292003642839E-2},null,"Two-tailed probability",{"$f":"MIN(H9,H12)*2","v":7.310659384955602E-2}]
[17,12,null,"Two-tailed significance",{"$f":"IF(E17<E7,\"S. (H1)\", \"NS (H0)\")","v":"S. (H1)"},null,"Two-tailed significance",{"$f":"IF(H17<H7,\"S. (H1)\", \"NS (H0)\")","v":"NS (H0)"}]
[18,35]
[19,22]
[20,18]
[21,23]
[22,24]
[23,22]
[24,19]
[25,12]
[26,33]
[27,25]
[28,22]
[29,21]
[30,40]

{"sheet":"Z.1.Test","index":3,"n_rows":31,"n_cols":17,"rows_kept":31,"cut":false,"hidden":false,"merged":[]}
["Data","x",null,"Z-test (m:M). Data",null,null,"Z-test (m:M). Result",null,null,"Data","x",null,"Z-test (m:M). Data",null,null,"Z-test (m:M). Result"]
[1,18,null,"m",21,null,"m",1.9,null,1,18,null,"m",20,null,"m",1.9]
[2,22,null,"v",45,null,"v",{"$f":"(0.2)^2","v":4.0000000000000008E-2},null,2,22,null,"v",{"$f":"N2","v":20},null,"v",{"$f":"(0.225)^2","v":5.0625000000000003E-2}]
[3,25,null,"sd",{"$f":"SQRT(E3)","v":6.7082039324993694},null,"sd",{"$f":"SQRT(H3)","v":0.2},null,3,25,null,"sd",{"$f":"SQRT(N3)","v":4.4721359549995796},null,"sd",{"$f":"SQRT(Q3)","v":0.22500000000000001}]
[4,12,null,"N",{"$f":"COUNT(B:B)","v":30},null,"N",10,null,4,12,null,"N",{"$f":"COUNT(K:K)","v":11},null,"N",10]
[5,22,null,"M",{"$f":"AVERAGE(B:B)","v":23.233333333333334},null,"M",2.0019999999999998,null,5,22,null,"M",{"$f":"AVERAGE(K:K)","v":24},null,"M",2.0019999999999998]
[6,31,null,"Significance level",0.05,null,"Significance level",0.05,null,6,31,null,"Significance level",0.05,null,"Significance level",0.05]
[7,32,null,"Z-value",{"$f":"(E6-E2)/SQRT(E3/E5)","v":1.8235090307385891},null,"Z-value",{"$f":"(H6-H2)/SQRT(H3/H5)","v":1.6127616066858712},null,7,32,null,"Z-value",{"$f":"(N6-N2)/SQRT(N3/N5)","v":2.9664793948382653},null,"Z-value",{"$f":"(Q6-Q2)/SQRT(Q3/Q5)","v":1.4335658726096634}]
[8,22,null,"Lower probability",{"$f":"NORMSDIST(E8)","v":0.96588683471673153},null,"Lower probability",{"$f":"NORMSDIST(H8)","v":0.94660184485847609},null,8,22,null,"Lower probability",{"$f":"NORMSDIST(N8)","v":0.99849384727462731},null,"Lower probability",{"$f":"NORMSDIST(Q8)","v":0.92415190586578833}]
[9,25,null,"Lower critical value",{"$f":"NORMSINV(E7)","v":-1.6448536269514726},null,"Lower critical value",{"$f":"NORMSINV(H7)","v":-1.6448536269514726},null,9,25,null,"Lower critical value",{"$f":"NORMSINV(N7)","v":-1.6448536269514726},null,"Lower critical value",{"$f":"NORMSINV(Q7)","v":-1.6448536269514726}]
[10,18,null,"Lower significance",{"$f":"IF(E9<E7,\"S. (H1)\", \"NS (H0)\")","v":"NS (H0)"},null,"Lower significance",{"$f":"IF(H9<H7,\"S. (H1)\", \"NS (H0)\")","v":"NS (H0)"},null,10,22,null,"Lower significance",{"$f":"IF(N9<N7,\"S. (H1)\", \"NS (H0)\")","v":"NS (H0)"},null,"Lower significance",{"$f":"IF(Q9<Q7,\"S. (H1)\", \"NS (H0)\")","v":"NS (H0)"}]
[11,20,null,"Upper probability",{"$f":"1-E9","v":3.4113165283268465E-2},null,"Upper probability",{"$f":"1-H9","v":5.3398155141523906E-2},null,11,33,null,"Upper probability",{"$f":"1-N9","v":1.5061527253726892E-3},null,"Upper probability",{"$f":"1-Q9","v":7.5848094134211674E-2}]
[12,30,null,"Upper critical value",{"$f":"NORMSINV(1-E7)","v":1.6448536269514715},null,"Upper critical value",{"$f":"NORMSINV(1-H7)","v":1.6448536269514715},null,null,null,null,"Upper critical value",{"$f":"NORMSINV(1-N7)","v":1.6448536269514715},null,"Upper critical value",{"$f":"NORMSINV(1-Q7)","v":1.6448536269514715}]
[13,29,null,"Upper significance",{"$f":"IF(E12<E7,\"S. (H1)\", \"NS (H0)\")","v":"S. (H1)"},null,"Upper significance",{"$f":"IF(H12<H7,\"S. (H1)\", \"NS (H0)\")","v":"NS (H0)"},null,null,null,null,"Upper significance",{"$f":"IF(N12<N7,\"S. (H1)\", \"NS (H0)\")","v":"S. (H1)"},null,"Upper significance",{"$f":"IF(Q12<Q7,\"S. (H1)\", \"NS (H0)\")","v":"NS (H0)"}]
[14,27,null,"Two-tailed probability",{"$f":"2*MIN(E9,E12)","v":6.822633056653693E-2},null,"Two-tailed probability",{"$f":"2*MIN(H9,H12)","v":0.10679631028304781},null,null,null,null,"Two-tailed probability",{"$f":"2*MIN(N9,N12)","v":3.0123054507453784E-3},null,"Two-tailed probability",{"$f":"2*MIN(Q9,Q12)","v":0.15169618826842335}]
[15,25,null,"Two-tailed critical value",{"$f":"NORMSINV(1-E7/2)","v":1.9599639845400536},null,"Two-tailed critical value",{"$f":"NORMSINV(1-H7/2)","v":1.9599639845400536},null,null,null,null,"Two-tailed critical value",{"$f":"ABS(NORMSINV(N7/2))","v":1.9599639845400538},null,"Two-tailed critical value",{"$f":"ABS(NORMSINV(Q7/2))","v":1.9599639845400538}]
[16,11,null,"Two-tailed significance",{"$f":"IF(E15<E7,\"S. (H1)\", \"NS (H0)\")","v":"NS (H0)"},null,"Two-tailed significance",{"$f":"IF(H15<H7,\"S. (H1)\", \"NS (H0)\")","v":"NS (H0)"},null,null,null,null,"Two-tailed significance",{"$f":"IF(N15<N7,\"S. (H1)\", \"NS (H0)\")","v":"S. (H1)"},null,"Two-tailed significance",{"$f":"IF(Q15<Q7,\"S. (H1)\", \"NS (H0)\")","v":"NS (H0)"}]
[17,12]
[18,35]
[19,22]
[20,18]
[21,23]
[22,24]
[23,22]
[24,19]
[25,12]
[26,33]
[27,25]
[28,22]
[29,21]
[30,40]

{"sheet":"Z.2.Test","index":4,"n_rows":39,"n_cols":11,"rows_kept":39,"cut":false,"hidden":false,"merged":[]}
["標本数","After","Before",null,"Z.2-test (m:M). Data",{"$f":"B1","v":"After"},{"$f":"C1","v":"Before"},null,"z-検定: 2 標本による平均の検定"]
[1,19,19,null,"M",{"$f":"AVERAGE(B:B)","v":22.4},{"$f":"AVERAGE(C:C)","v":19.033333333333335}]
[2,30,20,null,"u.V",{"$f":"VAR(B:B)","v":25.351724137931061},{"$f":"VAR(C:C)","v":20.171264367816107},null,null,"After","Before"]
[3,29,15,null,"u.SD",{"$f":"STDEV(B:B)","v":5.0350495665813524},{"$f":"STDEV(C:C)","v":4.491243076010929},null,"平均",22.4,19.033333333333335]
[4,27,23,null,"N",{"$f":"STDEV(B:B)","v":5.0350495665813524},{"$f":"COUNT(C:C)","v":30},null,"既知の分散",25.351700000000001,20.171299999999999]
[5,18,16,null,"Significance level",0.05,null,null,"観測数",30,30]
[6,20,13,null,"Z-value",{"$f":"(F2-G2)/SQRT(F3/F5+G3/G5)","v":1.4092239345378172},null,null,"仮説平均との差異",0]
[7,35,14,null,"Lower probability",{"$f":"NORMSDIST(F7)","v":0.92061551870320357},null,null,"z",2.7330357279026907]
[8,17,27,null,"Lower critical value",{"$f":"NORMSINV(F6)","v":-1.6448536269514726},null,null,"P(Z<=z) 片側",3.1376762382068213E-3]
[9,14,24,null,"Lower significance",{"$f":"IF(F8<F6,\"S. (H1)\", \"NS (H0)\")","v":"NS (H0)"},null,null,"z 境界値 片側",1.6448536269514715]
[10,24,30,null,"Upper probability",{"$f":"1-F8","v":7.9384481296796428E-2},null,null,"P(Z<=z) 両側",6.2753524764136426E-3]
[11,26,12,null,"Upper critical value",{"$f":"NORMSINV(1-F6)","v":1.6448536269514715},null,null,"z 境界値 両側",1.9599639845400536]
[12,21,16,null,"Upper significance",{"$f":"IF(F11<F6,\"S. (H1)\", \"NS (H0)\")","v":"NS (H0)"}]
[13,24,20,null,"Two-tailed probability",{"$f":"2*MIN(F8,F11)","v":0.15876896259359286}]
[14,24,16,null,"Two-tailed critical value",{"$f":"NORMSINV(1-F6/2)","v":1.9599639845400536}]
[15,15,22,null,"Two-tailed significance",{"$f":"IF(F14<F6,\"S. (H1)\", \"NS (H0)\")","v":"NS (H0)"}]
[16,14,15]
[17,24,20,null,"Z.2-test (m:M). Result",{"$f":"F1","v":"After"},{"$f":"G1","v":"Before"}]
[18,22,13,null,"M",22.4,19.033333333333335]
[19,16,14,null,"u.V",25.351724137931061,20.171264367816107]
[20,20,17,null,"u.SD",5.0350495665813524,4.491243076010929]
[21,18,16,null,"N",30,30]
[22,19,21,null,"Significance level",0.05]
[23,26,24,null,"Z-value",{"$f":"(F19-G19)/SQRT(F20/F22+G20/G22)","v":2.7330360729393708}]
[24,25,19,null,"Lower probability",{"$f":"NORMSDIST(F24)","v":0.99686232704877442}]
[25,24,23,null,"Lower critical value",{"$f":"NORMSINV(F23)","v":-1.6448536269514726}]
[26,28,18,null,"Lower significance",{"$f":"IF(F25<F23,\"S. (H1)\", \"NS (H0)\")","v":"NS (H0)"}]
[27,21,17,null,"Upper probability",{"$f":"1-F25","v":3.1376729512255785E-3}]
[28,23,20,null,"Upper critical value",{"$f":"NORMSINV(1-F23)","v":1.6448536269514715}]
[29,28,21,null,"Upper significance",{"$f":"IF(F28<F23,\"S. (H1)\", \"NS (H0)\")","v":"S. (H1)"}]
[30,21,26,null,"Two-tailed probability",{"$f":"2*MIN(F25,F28)","v":6.2753459024511571E-3}]
[null,null,null,null,"Two-tailed critical value",{"$f":"NORMSINV(1-F23/2)","v":1.9599639845400536}]
[null,null,null,null,"Two-tailed significance",{"$f":"IF(F31<F23,\"S. (H1)\", \"NS (H0)\")","v":"S. (H1)"}]
[]
[null,null,null,null,"Reference:"]
[null,null,null,null,"http://www2.tbb.t-com.ne.jp/ohara/toukeikiso/EXCE%EF%BD%8C%E7%B5%B1%E8%A8%881.htm"]
[null,null,null,null,"https://support.office.com/en-us/article/z-test-function-d633d5a3-2031-4614-a016-92180ad82bee"]
[null,null,null,null,"https://www.youtube.com/watch?v=125lmmCB_SA"]
[null,null,null,null,"エクスメディア『ＥＸＣＥＬ関数活用SUPER MASTER』"]

{"sheet":"t.1.Test","index":5,"n_rows":23,"n_cols":11,"rows_kept":23,"cut":false,"hidden":false,"merged":[]}
["n","x",null,"t-test.0 (M:m).Data",null,null,"t-test.0 (M:m).Result.V",null,null,"t-test.0 (M:m).Result.SD"]
[1,34,null,"m",20,null,"m",60,null,"m",60]
[2,18,null,"N",{"$f":"COUNT(B:B)","v":15},null,"N",10,null,"N",20]
[3,26,null,"M",{"$f":"AVERAGE(B:B)","v":29.866666666666667},null,"M",65,null,"M",65]
[4,40,null,"u.V",{"$f":"VAR(B:B)","v":461.40952380952382},null,"u.V",904.16666666666674,null,"u.V",{"$f":"K6^2","v":100}]
[5,22,null,"u.SD",{"$f":"SQRT(E5)","v":21.480445149240364},null,"u.SD",{"$f":"SQRT(H5)","v":30.069364254447862},null,"u.SD",10]
[6,99,null,"Significance level",0.05,null,"Significance level",0.05,null,"Significance level",0.05]
[7,10,null,"Degree of freedom",{"$f":"E3-1","v":14},null,"Degree of freedom",{"$f":"H3-1","v":9},null,"Degree of freedom",{"$f":"K3-1","v":19}]
[8,12,null,"Standard error",{"$f":"SQRT(E5/E3)","v":5.5462270888086547},null,"Standard error",{"$f":"SQRT(H5/H3)","v":9.5087678837306076},null,"Standard error",{"$f":"SQRT(K5/K3)","v":2.2360679774997898}]
[9,34,null,"t-value",{"$f":"(E4-E2)/SQRT(E5/E3)","v":1.7789871400282051},null,"t-value",{"$f":"(H4-H2)/SQRT(H5/H3)","v":0.52583048204961891},null,"t-value",{"$f":"(K4-K2)/SQRT(K5/K3)","v":2.2360679774997898}]
[10,22,null,"Lower probability",{"$f":"_xlfn.T.DIST(E10,E8,1)","v":0.9515230322494258},null,"Lower probability",{"$f":"_xlfn.T.DIST(H10,H8,1)","v":0.69414255120773571},null,"Lower probability",{"$f":"_xlfn.T.DIST(K10,K8,1)","v":0.98122972522573748}]
[11,41,null,"Lower critical value",{"$f":"_xlfn.T.INV(E7,E8)","v":-1.7613101357748921},null,"Lower critical value",{"$f":"_xlfn.T.INV(H7,H8)","v":-1.8331129326562374},null,"Lower critical value",{"$f":"_xlfn.T.INV(K7,K8)","v":-1.7291328115213698}]
[12,12,null,"Lower significance",{"$f":"IF(E11<E7,\"S. (H1)\", \"NS (H0)\")","v":"NS (H0)"},null,"Lower significance",{"$f":"IF(H11<H7,\"S. (H1)\", \"NS (H0)\")","v":"NS (H0)"},null,"Lower significance",{"$f":"IF(K11<K7,\"S. (H1)\", \"NS (H0)\")","v":"NS (H0)"}]
[13,32,null,"Upper probability",{"$f":"1-E11","v":4.8476967750574196E-2},null,"Upper probability",{"$f":"1-H11","v":0.30585744879226429},null,"Upper probability",{"$f":"1-K11","v":1.8770274774262519E-2}]
[14,25,null,"Upper critical value",{"$f":"_xlfn.T.INV(1-E7,E8)","v":1.7613101357748921},null,"Upper critical value",{"$f":"_xlfn.T.INV(1-H7,H8)","v":1.8331129326562368},null,"Upper critical value",{"$f":"_xlfn.T.INV(1-K7,K8)","v":1.7291328115213698}]
[15,21,null,"Upper significance",{"$f":"IF(E14<E7,\"S. (H1)\", \"NS (H0)\")","v":"S. (H1)"},null,"Upper significance",{"$f":"IF(H14<H7,\"S. (H1)\", \"NS (H0)\")","v":"NS (H0)"},null,"Upper significance",{"$f":"IF(K14<K7,\"S. (H1)\", \"NS (H0)\")","v":"S. (H1)"}]
[null,null,null,"Two-tailed probability",{"$f":"TDIST(ABS(E10),E8,2)","v":9.695393550114835E-2},null,"Two-tailed probability",{"$f":"TDIST(ABS(H10),H8,2)","v":0.61171489758452857},null,"Two-tailed probability",{"$f":"TDIST(ABS(K10),K8,2)","v":3.7540549548525037E-2}]
[null,null,null,"Two-tailed critical value",{"$f":"ABS(_xlfn.T.INV(E7/2,E8))","v":2.1447866879178044},null,"Two-tailed critical value",{"$f":"ABS(_xlfn.T.INV(H7/2,H8))","v":2.2621571627982053},null,"Two-tailed critical value",{"$f":"ABS(_xlfn.T.INV(K7/2,K8))","v":2.0930240544083096}]
[null,null,null,"Two-tailed significance",{"$f":"IF(E17<E7,\"S. (H1)\", \"NS (H0)\")","v":"NS (H0)"},null,"Two-tailed significance",{"$f":"IF(H17<H7,\"S. (H1)\", \"NS (H0)\")","v":"NS (H0)"},null,"Two-tailed significance",{"$f":"IF(K17<K7,\"S. (H1)\", \"NS (H0)\")","v":"S. (H1)"}]
[]
[null,null,null,"t = (M-m) / √(u.V/N)"]
[null,null,null,"Lower-prob. = T.DIST(t, df, 1)"]
[null,null,null,"Upper-prob.=1-Lower.p"]

{"sheet":"t.2.Test","index":6,"n_rows":33,"n_cols":8,"rows_kept":33,"cut":false,"hidden":false,"merged":[]}
["n","x","y","x-y",null,"t-test.1 (M1-M2) paired test"]
[1,26,15,{"$f":"B2-C2","v":11},null,"M(X-Y)",{"$f":"AVERAGE(D:D)","v":4.833333333333333}]
[2,19,16,3,null,"N",{"$f":"COUNT(D:D)","v":6}]
[3,21,14,7,null,"u.V(X-Y)",{"$f":"VAR(D:D)","v":13.766666666666669}]
[4,16,15,1,null,"u.SD(X-Y)",{"$f":"SQRT(G4)","v":3.710345895825168}]
[5,25,20,5,null,"Significance level",0.05]
[6,17,15,2,null,"Degree of freedom",{"$f":"G3-1","v":5}]
[null,null,null,null,null,"t-value",{"$f":"G2/SQRT(G4/G3)","v":3.1908616489835455}]
[null,null,null,null,null,"Lower probability",{"$f":"_xlfn.T.DIST(G8,G7,1)","v":0.98787919761031717}]
[null,null,null,null,null,"Lower critical value",{"$f":"_xlfn.T.INV(G6,G7)","v":-2.0150483733330233}]
[null,null,null,null,null,"Lower significance",{"$f":"IF(G9<G6,\"S. (H1)\", \"NS (H0)\")","v":"NS (H0)"}]
[null,null,null,null,null,"Upper probability",{"$f":"1-G9","v":1.2120802389682828E-2}]
[null,null,null,null,null,"Upper critical value",{"$f":"_xlfn.T.INV(1-G6,G7)","v":2.0150483733330233}]
[null,null,null,null,null,"Upper significance",{"$f":"IF(G12<G6,\"S. (H1)\", \"NS (H0)\")","v":"S. (H1)"}]
[null,null,null,null,null,"Two-tailed probability",{"$f":"TDIST(ABS(G8),G7,2)","v":2.4241604779365624E-2}]
[null,null,null,null,null,"Two-tailed critical value",{"$f":"TINV(G6,G7)","v":2.570581835636315}]
[null,null,null,null,null,"Two-tailed significance",{"$f":"IF(G15<G6,\"S. (H1)\", \"NS (H0)\")","v":"S. (H1)"}]
[]
[]
[null,null,null,null,null,"t-検定: 一対の標本による平均の検定ツール"]
[]
[null,null,null,null,null,null,"x","y"]
[null,null,null,null,null,"平均",20.666666666666668,15.833333333333334]
[null,null,null,null,null,"分散",17.066666666666698,4.5666666666666513]
[null,null,null,null,null,"観測数",6,6]
[null,null,null,null,null,"ピアソン相関",0.44554004383100537]
[null,null,null,null,null,"仮説平均との差異",0]
[null,null,null,null,null,"自由度",5]
[null,null,null,null,null,"t ",3.1908616489835455]
[null,null,null,null,null,"P(T<=t) 片側",1.2120802389682812E-2]
[null,null,null,null,null,"t 境界値 片側",2.0150483733330233]
[null,null,null,null,null,"P(T<=t) 両側",2.4241604779365624E-2]
[null,null,null,null,null,"t 境界値 両側",2.570581835636315]

{"sheet":"t.3.Test","index":7,"n_rows":38,"n_cols":11,"rows_kept":38,"cut":false,"hidden":false,"merged":[]}
["N","X","Y",null,"t.3.test (same var.). Data","X","Y"]
[1,33,30,null,"N",{"$f":"COUNT(B:B)","v":5},{"$f":"COUNT(C:C)","v":7}]
[2,37,31,null,"M",{"$f":"AVERAGE(B:B)","v":34.6},{"$f":"AVERAGE(C:C)","v":33.142857142857146},null,"t-検定: 等分散を仮定した２標本による検定"]
[3,35,32,null,"V",{"$f":"_xlfn.VAR.S(B:B)","v":4.3},{"$f":"_xlfn.VAR.S(C:C)","v":5.1428571428571432}]
[4,36,35,null,"Significance level",0.05,null,null,null,"X","Y"]
[5,32,36,null,"Degree of freedom",{"$f":"F2+G2-2","v":10},null,null,"平均",34.6,33.142857142857146]
[6,null,35,null,"Standard deviation",{"$f":"SQRT(F4)","v":2.0736441353327719},{"$f":"SQRT(G4)","v":2.2677868380553634},null,"分散",4.3,5.1428571428571432]
[7,null,33,null,"Standard error",{"$f":"SQRT(F4/F2)","v":0.92736184954957035},{"$f":"SQRT(G4/G2)","v":0.85714285714285721},null,"観測数",5,7]
[null,null,null,null,"t-value",{"$f":"(F3-G3)/SQRT((1/F2+1/G2)*(((F2-1)*F4+(G2-1)*G4)/(F6)))","v":1.1351847738883796},null,null,"プールされた分散",4.805714285714286]
[null,null,null,null,"Lower probability",{"$f":"_xlfn.T.DIST(F9,F6,1)","v":0.85861306770549528},null,null,"仮説平均との差異",0]
[null,null,null,null,"Lower critical value",{"$f":"_xlfn.T.INV(F5,F6)","v":-1.812461122811676},null,null,"自由度",10]
[null,null,null,null,"Lower significance",{"$f":"IF(F10<F5,\"S. (H1)\", \"NS (H0)\")","v":"NS (H0)"},null,null,"t ",1.1351847738883796]
[null,null,null,null,"Upper probability",{"$f":"1-F10","v":0.14138693229450472},null,null,"P(T<=t) 片側",0.14138693229450475]
[null,null,null,null,"Upper critical value",{"$f":"_xlfn.T.INV(1-F5,F6)","v":1.8124611228116754},null,null,"t 境界値 片側",1.812461122811676]
[null,null,null,null,"Upper significance",{"$f":"IF(F13<F5,\"S. (H1)\", \"NS (H0)\")","v":"NS (H0)"},null,null,"P(T<=t) 両側",0.28277386458900949]
[null,null,null,null,"Two-tailed probability",{"$f":"TDIST(ABS(F9),F6,2)","v":0.28277386458900949},null,null,"t 境界値 両側",2.2281388519862744]
[null,null,null,null,"Two-tailed critical value",{"$f":"TINV(F5,F6)","v":2.2281388519862744}]
[null,null,null,null,"Two-tailed significance",{"$f":"IF(F16<F5,\"S. (H1)\", \"NS (H0)\")","v":"NS (H0)"}]
[]
[]
[null,null,null,null,"t.3.test (same var.) Result","X","Y"]
[null,null,null,null,"N",5,7]
[null,null,null,null,"M",34.6,33.142899999999997]
[null,null,null,null,"V",4.3,5.1429]
[null,null,null,null,"Significance level",0.05]
[null,null,null,null,"Degree of freedom",{"$f":"F22+G22-2","v":10}]
[null,null,null,null,"Standard deviation",{"$f":"SQRT(F24)","v":2.0736441353327719},{"$f":"SQRT(G24)","v":2.2677962871475033}]
[null,null,null,null,"Standard error",{"$f":"SQRT(F24/F22)","v":0.92736184954957035},{"$f":"SQRT(G24/G22)","v":0.85714642856398815}]
[null,null,null,null,"t-value",{"$f":"(F23-G23)/SQRT((1/F22+1/G22)*(((F22-1)*F24+(G22-1)*G24)/(F26)))","v":1.1351483491444729}]
[null,null,null,null,"Lower probability",{"$f":"_xlfn.T.DIST(F29,F26,1)","v":0.85860579081281618}]
[null,null,null,null,"Lower critical value",{"$f":"_xlfn.T.INV(F25,F26)","v":-1.812461122811676}]
[null,null,null,null,"Lower significance",{"$f":"IF(F30<F25,\"S. (H1)\", \"NS (H0)\")","v":"NS (H0)"}]
[null,null,null,null,"Upper probability",{"$f":"1-F30","v":0.14139420918718382}]
[null,null,null,null,"Upper critical value",{"$f":"_xlfn.T.INV(1-F25,F26)","v":1.8124611228116754}]
[null,null,null,null,"Upper significance",{"$f":"IF(F33<F25,\"S. (H1)\", \"NS (H0)\")","v":"NS (H0)"}]
[null,null,null,null,"Two-tailed probability",{"$f":"TDIST(ABS(F29),F26,2)","v":0.28278841837436763}]
[null,null,null,null,"Two-tailed critical value",{"$f":"TINV(F25,F26)","v":2.2281388519862744}]
[null,null,null,null,"Two-tailed significance",{"$f":"IF(F36<F25,\"S. (H1)\", \"NS (H0)\")","v":"NS (H0)"}]

{"sheet":"t.4.Test","index":8,"n_rows":37,"n_cols":11,"rows_kept":37,"cut":false,"hidden":false,"merged":[]}
["N","X","Y",null,"t-test.3 (diff. var.) Data","X","Y"]
[1,33,30,null,"N",{"$f":"COUNT(B:B)","v":5},{"$f":"COUNT(C:C)","v":8},null,"t-検定: 分散が等しくないと仮定した２標本による検定"]
[2,31,31,null,"M",{"$f":"AVERAGE(B:B)","v":33.200000000000003},{"$f":"AVERAGE(C:C)","v":35.125}]
[3,35,32,null,"V",{"$f":"_xlfn.VAR.S(B:B)","v":5.1999999999999993},{"$f":"_xlfn.VAR.S(C:C)","v":21.267857142857142},null,null,"X","Y"]
[4,36,39,null,"Significance level",0.05,null,null,"平均",33.200000000000003,35.125]
[5,31,44,null,"Degree of freedom",{"$f":"ROUND((F4/F2+G4/G2)^2/((F4/F2)^2/(F2-1)+(G4/G2)^2/(G2-1)),0)","v":11},null,null,"分散",5.1999999999999993,21.267857142857142]
[6,null,34,null,"Standard deviation",{"$f":"SQRT(F4)","v":2.2803508501982757},{"$f":"SQRT(G4)","v":4.6117087009976183},null,"観測数",5,8]
[7,null,36,null,"Standard error",{"$f":"SQRT(F4/F2)","v":1.0198039027185568},{"$f":"SQRT(G4/G2)","v":1.6304852476662102},null,"仮説平均との差異",0]
[8,null,35,null,"t-value",{"$f":"(F3-G3)/SQRT(F4/F2+G4/G2)","v":-1.0009651813167773},null,null,"自由度",11]
[null,null,null,null,"Lower probability",{"$f":"_xlfn.T.DIST(F9,F6,1)","v":0.16917713425950925},null,null,"t ",-1.0009651813167773]
[null,null,null,null,"Lower critical value",{"$f":"_xlfn.T.INV(F5,F6)","v":-1.7958848187040437},null,null,"P(T<=t) 片側",0.16917713425950925]
[null,null,null,null,"Lower significance",{"$f":"IF(F10<F5,\"S. (H1)\", \"NS (H0)\")","v":"NS (H0)"},null,null,"t 境界値 片側",1.7958848187040437]
[null,null,null,null,"Upper probability",{"$f":"1-F10","v":0.8308228657404908},null,null,"P(T<=t) 両側",0.33835426851901851]
[null,null,null,null,"Upper critical value",{"$f":"_xlfn.T.INV(1-F5,F6)","v":1.795884818704043},null,null,"t 境界値 両側",2.2009851600916384]
[null,null,null,null,"Upper significance",{"$f":"IF(F13<F5,\"S. (H1)\", \"NS (H0)\")","v":"NS (H0)"}]
[null,null,null,null,"Two-tailed probability",{"$f":"TDIST(ABS(F9),F6,2)","v":0.33835426851901851}]
[null,null,null,null,"Two-tailed critical value",{"$f":"TINV(F5,F6)","v":2.2009851600916384}]
[null,null,null,null,"Two-tailed significance",{"$f":"IF(F16<F5/2,\"S. (H1)\", \"NS (H0)\")","v":"NS (H0)"}]
[]
[null,null,null,null,"t-test.3 (diff. var.) Result","X","Y"]
[null,null,null,null,"N",20,20]
[null,null,null,null,"M",390.75,371.75]
[null,null,null,null,"V",2239.4609999999998,914.93420000000003]
[null,null,null,null,"Significance level",0.05]
[null,null,null,null,"Degree of freedom",{"$f":"ROUND((F23/F21+G23/G21)^2/((F23/F21)^2/(F21-1)+(G23/G21)^2/(G21-1)),0)","v":32}]
[null,null,null,null,"Standard deviation",{"$f":"SQRT(F23)","v":47.322943695421145},{"$f":"SQRT(G23)","v":30.247879264503819}]
[null,null,null,null,"Standard error",{"$f":"SQRT(F23/F21)","v":10.581731899835678},{"$f":"SQRT(G23/G21)","v":6.7636314210636881}]
[null,null,null,null,"t-value",{"$f":"(F22-G22)/SQRT(F23/F21+G23/G21)","v":1.5129011297367905}]
[null,null,null,null,"Lower probability",{"$f":"_xlfn.T.DIST(F28,F25,1)","v":0.9299402905554276}]
[null,null,null,null,"Lower critical value",{"$f":"_xlfn.T.INV(F24,F25)","v":-1.6938887483837093}]
[null,null,null,null,"Lower significance",{"$f":"IF(F29<F24,\"S. (H1)\", \"NS (H0)\")","v":"NS (H0)"}]
[null,null,null,null,"Upper probability",{"$f":"1-F29","v":7.0059709444572404E-2}]
[null,null,null,null,"Upper critical value",{"$f":"_xlfn.T.INV(1-F24,F25)","v":1.6938887483837093}]
[null,null,null,null,"Upper significance",{"$f":"IF(F32<F24,\"S. (H1)\", \"NS (H0)\")","v":"NS (H0)"}]
[null,null,null,null,"Two-tailed probability",{"$f":"TDIST(ABS(F28),F25,2)","v":0.14011941888914473}]
[null,null,null,null,"Two-tailed critical value",{"$f":"TINV(F24,F25)","v":2.0369333434601011}]
[null,null,null,null,"Two-tailed significance",{"$f":"IF(F35<F24/2,\"S. (H1)\", \"NS (H0)\")","v":"NS (H0)"}]

{"sheet":"F.Test","index":9,"n_rows":22,"n_cols":11,"rows_kept":22,"cut":false,"hidden":false,"merged":[]}
["N","X","Y",null,"F-test. Data","X","Y",null,"F-検定: 2 標本を使った分散の検定"]
[1,33,30,null,"N",{"$f":"COUNT(B:B)","v":5},{"$f":"COUNT(C:C)","v":8}]
[2,31,31,null,"M",{"$f":"AVERAGE(B:B)","v":33.200000000000003},{"$f":"AVERAGE(C:C)","v":35.125},null,null,"X","Y"]
[3,35,32,null,"V",{"$f":"_xlfn.VAR.S(B:B)","v":5.1999999999999993},{"$f":"_xlfn.VAR.S(C:C)","v":21.267857142857142},null,"平均",33.200000000000003,35.125]
[4,36,39,null,"Significance level",0.05,null,null,"分散",5.1999999999999993,21.267857142857142]
[5,31,44,null,"Degree of freedom",{"$f":"F2-1","v":4},{"$f":"G2-1","v":7},null,"観測数",5,8]
[6,null,34,null,"F-value",{"$f":"F4/G4","v":0.24450041981528126},null,null,"自由度",4,7]
[7,null,36,null,"Upper probability",{"$f":"IF(F4>G4, FDIST(F4/G4,F6,G6), FDIST(G4/F4,G6,F6))","v":9.5803506832385019E-2},null,null,"観測された分散比",0.24450041981528126]
[8,null,35,null,"Upper critical value",{"$f":"_xlfn.F.INV(F5,F6,G6)","v":0.16409015247290937},null,null,"P(F<=f) 片側",9.5803506832385033E-2]
[9,null,null,null,"Upper significance",{"$f":"IF(F8<F5,\"S. (H1)\", \"NS (H0)\")","v":"NS (H0)"},null,null,"F 境界値 片側",0.16409015247290945]
[]
[]
[null,null,null,null,"F-test. Result","X","Y"]
[null,null,null,null,"N",5,8]
[null,null,null,null,"M",33.200000000000003,35.125]
[null,null,null,null,"V",5.1999999999999993,21.267857142857142]
[null,null,null,null,"Significance level",0.05]
[null,null,null,null,"Degree of freedom",{"$f":"F14-1","v":4},{"$f":"G14-1","v":7}]
[null,null,null,null,"F-value",{"$f":"F16/G16","v":0.24450041981528126}]
[null,null,null,null,"Upper probability",{"$f":"IF(F16>G16, FDIST(F16/G16,F18,G18), FDIST(G16/F16,G18,F18))","v":9.5803506832385019E-2}]
[null,null,null,null,"Upper critical value",{"$f":"_xlfn.F.INV(F17,F14-1,G14-1)","v":0.16409015247290937}]
[null,null,null,null,"Upper significance",{"$f":"IF(F20<F17,\"S. (H1)\", \"NS (H0)\")","v":"NS (H0)"}]

{"sheet":"Chi^2.Test","index":10,"n_rows":44,"n_cols":20,"rows_kept":44,"cut":false,"hidden":false,"merged":[]}
["Chi^2 test: 2 x 2",null,null,null,1,null,"Chi^2 test: 2 x 3",null,null,null,null,1,null,"Chi^2 test: 2 x 4",null,null,null,null,null,1]
["Data:",1,2,"Sum",2,null,"Data:",1,2,3,"Sum",2,null,"Data:",1,2,3,4,"Sum",2]
[1,20,12,{"$f":"SUM(B3:C3)","v":32},3,null,1,20,15,5,{"$f":"SUM(H3:J3)","v":40},3,null,1,20,15,5,6,{"$f":"SUM(O3:R3)","v":46},3]
[2,15,25,{"$f":"SUM(B4:C4)","v":40},4,null,2,25,30,40,{"$f":"SUM(H4:J4)","v":95},4,null,2,25,30,40,22,{"$f":"SUM(O4:R4)","v":117},4]
["Sum",{"$f":"SUM(B3:B4)","v":35},{"$f":"SUM(C3:C4)","v":37},{"$f":"SUM(B5:C5)","v":72},5,null,"Sum",{"$f":"SUM(H3:H4)","v":45},{"$f":"SUM(I3:I4)","v":45},{"$f":"SUM(J3:J4)","v":45},{"$f":"SUM(H5:J5)","v":135},5,null,"Sum",{"$f":"SUM(O3:O4)","v":45},{"$f":"SUM(P3:P4)","v":45},{"$f":"SUM(Q3:Q4)","v":45},{"$f":"SUM(R3:R4)","v":28},{"$f":"SUM(O5:R5)","v":163},5]
["Significance level",0.05,null,null,6,null,"Significance level",0.05,null,null,null,6,null,"Significance level",0.05,null,null,null,null,6]
["Chi^2",{"$f":"D5*(B3^2/D3/B5+C3^2/D3/C5+B4^2/D4/B5+C4^2/D4/C5-1)","v":4.447876447876455},null,null,7,null,"Chi^2",{"$f":"K5*(H3^2/K3/H5+I3^2/K3/I5+J3^2/K3/J5+H4^2/K4/H5+I4^2/K4/I5+J4^2/K4/J5-1)","v":12.434210526315784},null,null,null,7,null,"Chi^2",{"$f":"S5*(O3^2/S3/O5+P3^2/S3/P5+Q3^2/S3/Q5+R3^2/S3/R5+O4^2/S4/O5+P4^2/S4/P5+Q4^2/S4/Q5+R4^2/S4/R5-1)","v":13.568670996207223},null,null,null,null,7]
["Upper probability",{"$f":"1-_xlfn.CHISQ.DIST(B7,1,1)","v":3.4944674787242724E-2},{"$f":"CHIDIST(B7,1)","v":3.4944674787242683E-2},null,8,null,"Upper probability",{"$f":"1-_xlfn.CHISQ.DIST(H7,2,1)","v":1.9950119011729051E-3},null,null,null,8,null,"Upper probability",{"$f":"1-_xlfn.CHISQ.DIST(O7,2,1)","v":1.131359244257113E-3},null,null,null,null,8]
["Upper critical value",{"$f":"CHIINV(B6,1)","v":3.8414588206941236},null,null,9,null,"Upper critical value",{"$f":"CHIINV(H6,2)","v":5.9914645471079817},null,null,null,9,null,"Upper critical value",{"$f":"CHIINV(O6,2)","v":5.9914645471079817},null,null,null,null,9]
["Upper significance",{"$f":"IF(B8<B6,\"S. (H1)\", \"NS (H0)\")","v":"S. (H1)"},null,null,10,null,"Upper significance",{"$f":"IF(H8<H6,\"S. (H1)\", \"NS (H0)\")","v":"S. (H1)"},null,null,null,10,null,"Upper significance",{"$f":"IF(O8<O6,\"S. (H1)\", \"NS (H0)\")","v":"S. (H1)"},null,null,null,null,10]
[]
["Chi^2 test: 3 x 2",null,null,null,12,null,"Chi^2 test: 3 x 3",null,null,null,null,12,null,"Chi^2 test: 3 x 4",null,null,null,null,null,12]
["Data:",1,2,"Sum",13,null,"Data:",1,2,3,"Sum",13,null,"Data:",1,2,3,4,"Sum",13]
[1,40,30,{"$f":"SUM(B14:C14)","v":70},14,null,1,40,30,28,{"$f":"SUM(H14:J14)","v":98},14,null,1,40,30,28,6,{"$f":"SUM(O14:R14)","v":104},14]
[2,44,22,{"$f":"SUM(B15:C15)","v":66},15,null,2,44,22,16,{"$f":"SUM(H15:J15)","v":82},15,null,2,44,22,16,22,{"$f":"SUM(O15:R15)","v":104},15]
[3,110,62,{"$f":"SUM(B16:C16)","v":172},16,null,3,110,62,98,{"$f":"SUM(H16:J16)","v":270},16,null,3,110,62,98,52,{"$f":"SUM(O16:R16)","v":322},16]
["Sum",{"$f":"SUM(B14:B16)","v":194},{"$f":"SUM(C14:C16)","v":114},{"$f":"SUM(B17:C17)","v":308},17,null,"Sum",{"$f":"SUM(H14:H16)","v":194},{"$f":"SUM(I14:I16)","v":114},{"$f":"SUM(J14:J16)","v":142},{"$f":"SUM(H17:J17)","v":450},17,null,"Sum",{"$f":"SUM(O14:O16)","v":194},{"$f":"SUM(P14:P16)","v":114},{"$f":"SUM(Q14:Q16)","v":142},{"$f":"SUM(R14:R16)","v":80},{"$f":"SUM(O17:R17)","v":530},17]
["Significance level",0.05,null,null,18,null,"Significance level",0.05,null,null,null,18,null,"Significance level",0.05,null,null,null,null,18]
["Chi^2",{"$f":"D17*(B14^2/D14/B17+C14^2/D14/C17+B15^2/D15/B17+C15^2/D15/C17+B16^2/D16/B17+C16^2/D16/C17-1)","v":1.4777277245699887},null,null,19,null,"Chi^2",{"$f":"K17*(H14^2/K14/H17+I14^2/K14/I17+J14^2/K14/J17+H15^2/K15/H17+I15^2/K15/I17+J15^2/K15/J17+H16^2/K16/H17+I16^2/K16/I17+J16^2/K16/J17-1)","v":10.305505849688501},null,null,null,19,null,"Chi^2",{"$f":"S17*(O14^2/S14/O17+P14^2/S14/P17+Q14^2/S14/Q17+R14^2/S14/R17+O15^2/S15/O17+P15^2/S15/P17+Q15^2/S15/Q17+R15^2/S15/R17+O16^2/S16/O17+P16^2/S16/P17+Q16^2/S16/Q17+R16^2/S16/R17-1)","v":20.32216721180092},null,null,null,null,19]
["Upper probability",{"$f":"1-_xlfn.CHISQ.DIST(B19,2,1)","v":0.47765629068290849},null,null,20,null,"Upper probability",{"$f":"1-_xlfn.CHISQ.DIST(H19,2,1)","v":5.7834613570062476E-3},null,null,null,20,null,"Upper probability",{"$f":"1-_xlfn.CHISQ.DIST(O19,2,1)","v":3.8645369119683082E-5},null,null,null,null,20]
["Upper critical value",{"$f":"CHIINV(B18,4)","v":9.4877290367811575},null,null,21,null,"Upper critical value",{"$f":"CHIINV(H18,4)","v":9.4877290367811575},null,null,null,21,null,"Upper critical value",{"$f":"CHIINV(O18,4)","v":9.4877290367811575},null,null,null,null,21]
["Upper significance",{"$f":"IF(B20<B18,\"S. (H1)\", \"NS (H0)\")","v":"NS (H0)"},null,null,22,null,"Upper significance",{"$f":"IF(H20<H18,\"S. (H1)\", \"NS (H0)\")","v":"S. (H1)"},null,null,null,22,null,"Upper significance",{"$f":"IF(O20<O18,\"S. (H1)\", \"NS (H0)\")","v":"S. (H1)"},null,null,null,null,22]
[]
["Expectation",1,2]
[1,{"$f":"$D3*B$5/$D$5","v":15.555555555555555},{"$f":"$D3*C$5/$D$5","v":16.444444444444443}]
[2,{"$f":"$D4*B$5/$D$5","v":19.444444444444443},{"$f":"$D4*C$5/$D$5","v":20.555555555555557}]
["Chi^2",1,2]
[1,{"$f":"(B3-B25)^2/B25","v":1.26984126984127},{"$f":"(C3-C25)^2/C25","v":1.2012012012012003}]
[2,{"$f":"(B4-B26)^2/B26","v":1.0158730158730152},{"$f":"(C4-C26)^2/C26","v":0.96096096096096018}]
[]
["Sum",{"$f":"SUM(B28:C29)","v":4.4478764478764461}]
[]
["=D5*(B3^2/D3/B5+C3^2/D3/C5+B4^2/D4/B5+C4^2/D4/C5-1)"]
["=N*(a^2/ab/ac+b^2/ab/bd+c^2/cd/ab+d^2/cd/bd-1)"]
[]
["Data:",1,2,"Sum",null,null,"Data:",1,2,"Sum"]
[1,25,12,37,null,null,1,20,12,32]
[2,15,20,35,null,null,2,15,25,40]
["Sum",40,32,72,null,null,"Sum",35,37,72]
["Significance level",0.05,null,null,null,null,"Significance level",0.05]
["Chi^2",4.447876447876439,null,null,null,null,"Chi^2",4.447876447876455]
["Upper probability",3.4944674787243057E-2,null,null,null,null,"Upper probability",3.4944674787242724E-2]
["Upper critical value",3.8414588206941236,null,null,null,null,"Upper critical value",3.8414588206941236]
["Upper significance","S. (H1)",null,null,null,null,"Upper significance","S. (H1)"]

{"sheet":"Fisher.test","index":11,"n_rows":102,"n_cols":13,"rows_kept":102,"cut":false,"hidden":false,"merged":[]}
["L.T.","T.1","T.2","計",null,"L.T.","T.1","T.2","計",null,"当該確率(t)",{"$f":"Fishert(G2,H2,G3,H3,0)","v":2.8669536199641504E-2},{"$f":"FisherU(G2,H2,G3,H3,0)","v":2.8669536199642152E-2}]
["L(+)","a","b",19,null,"L(+)",10,5,{"$f":"SUM(G2:H2)","v":15},null,"下側累積確率(p)",{"$f":"Fishert(G2,H2,G3,H3,1)","v":0.9942141832309469},{"$f":"FisherU(G2,H2,G3,H3,1)","v":0.99421418323096478}]
["L(-)","c","d",20,null,"L(-)",6,14,{"$f":"SUM(G3:H3)","v":20},null,"上側累積確率(ｑ)",{"$f":"Fishert(G2,H2,G3,H3,2)","v":3.4455352968676245E-2},{"$f":"FisherU(G2,H2,G3,H3,2)","v":3.4455352968676994E-2}]
["計",21,18,39,null,"計",{"$f":"SUM(G2:G3)","v":16},{"$f":"SUM(H2:H3)","v":19},{"$f":"SUM(G4:H4)","v":35},null,"両側累積確率(r)",{"$f":"Fishert(G2,H2,G3,H3,3)","v":4.4203997707890019E-2},{"$f":"FisherU(G2,H2,G3,H3,3)","v":4.4203997707890963E-2}]
[null,null,null,null,null,null,null,null,null,null,null,"FisherT","Excel"]
["a","b","c","d","N","P","Lower ac. p.","Upper ac. p."]
[0,15,16,4,35,1.1933706376807159E-6,1.1933706376807159E-6,1]
[1,14,15,5,35,5.7281790608674451E-5,5.8475161246355168E-5,0.99999880662936236]
[2,13,14,6,35,1.0024313356518004E-3,1.0609064968981556E-3,0.99994152483875365]
[3,12,13,7,35,8.6877382423156211E-3,9.748644739213776E-3,0.99893909350310184]
[4,11,12,8,35,4.235272393128852E-2,5.2101368670502295E-2,0.99025135526078623]
[5,10,11,9,35,0.12423465686511342,0.17633602553561573,0.9478986313294977]
[6,9,10,10,35,0.22776353758604101,0.40409956312165674,0.82366397446438433]
[7,8,9,11,35,0.26621712185381502,0.67031668497547181,0.59590043687834315]
[8,7,8,12,35,0.19966284139036147,0.86997952636583331,0.32968331502452819]
[9,6,7,13,35,9.5565120665472014E-2,0.96554464703130538,0.13002047363416663]
[10,5,6,14,35,2.8669536199641504E-2,0.9942141832309469,3.4455352968694605E-2]
[11,4,5,15,35,5.2126429453893831E-3,0.99942682617633627,5.7858167690531138E-3]
[12,3,4,16,35,5.429836401447261E-4,0.99996980981648098,5.7317382366374491E-4]
[13,2,3,17,35,2.9483274577994255E-5,0.99999929309105895,3.0190183519044776E-5]
[14,1,2,18,35,7.0198272804748375E-7,0.99999999507378701,7.0690894104056758E-7]
[15,0,1,19,35,4.9261945827893416E-9,0.99999999999998157,4.9262130124915504E-9]
[]
["a","b","c","d","N","P","Lower ac. p.","Upper ac. p.","Two-sided"]
[0,15,16,4,35,{"$f":"Fishert(A25,B25,C25,D25,0)","v":1.1933706376807159E-6},{"$f":"Fishert(A25,B25,C25,D25,1)","v":1.1933706376807159E-6},{"$f":"Fishert(A25,B25,C25,D25,2)","v":0.99999999999998157},{"$f":"Fishert(A25,B25,C25,D25,3)","v":1.9002795603109888E-6}]
[1,14,15,5,35,{"$f":"Fishert(A26,B26,C26,D26,0)","v":5.7281790608674451E-5},{"$f":"Fishert(A26,B26,C26,D26,1)","v":5.8475161246355168E-5},{"$f":"Fishert(A26,B26,C26,D26,2)","v":0.99999880662934371},{"$f":"Fishert(A26,B26,C26,D26,3)","v":8.8665344746979694E-5}]
[2,13,14,6,35,{"$f":"Fishert(A27,B27,C27,D27,0)","v":1.0024313356518004E-3},{"$f":"Fishert(A27,B27,C27,D27,1)","v":1.0609064968981556E-3},{"$f":"Fishert(A27,B27,C27,D27,2)","v":0.99994152483873511},{"$f":"Fishert(A27,B27,C27,D27,3)","v":1.6340803205435062E-3}]
[3,12,13,7,35,{"$f":"Fishert(A28,B28,C28,D28,0)","v":8.6877382423156211E-3},{"$f":"Fishert(A28,B28,C28,D28,1)","v":9.748644739213776E-3},{"$f":"Fishert(A28,B28,C28,D28,2)","v":0.9989390935030833},{"$f":"Fishert(A28,B28,C28,D28,3)","v":1.5534461508248509E-2}]
[4,11,12,8,35,{"$f":"Fishert(A29,B29,C29,D29,0)","v":4.235272393128852E-2},{"$f":"Fishert(A29,B29,C29,D29,1)","v":5.2101368670502295E-2},{"$f":"Fishert(A29,B29,C29,D29,2)","v":0.99025135526076768},{"$f":"Fishert(A29,B29,C29,D29,3)","v":8.6556721639178519E-2}]
[5,10,11,9,35,{"$f":"Fishert(A30,B30,C30,D30,0)","v":0.12423465686511342},{"$f":"Fishert(A30,B30,C30,D30,1)","v":0.17633602553561573},{"$f":"Fishert(A30,B30,C30,D30,2)","v":0.94789863132947927},{"$f":"Fishert(A30,B30,C30,D30,3)","v":0.30635649916976393}]
[6,9,10,10,35,{"$f":"Fishert(A31,B31,C31,D31,0)","v":0.22776353758604101},{"$f":"Fishert(A31,B31,C31,D31,1)","v":0.40409956312165674},{"$f":"Fishert(A31,B31,C31,D31,2)","v":0.82366397446436568},{"$f":"Fishert(A31,B31,C31,D31,3)","v":0.73378287814616638}]
[7,8,9,11,35,{"$f":"Fishert(A32,B32,C32,D32,0)","v":0.26621712185381502},{"$f":"Fishert(A32,B32,C32,D32,1)","v":0.67031668497547181},{"$f":"Fishert(A32,B32,C32,D32,2)","v":0.59590043687832472},{"$f":"Fishert(A32,B32,C32,D32,3)","v":0.99999999999998157}]
[8,7,8,12,35,{"$f":"Fishert(A33,B33,C33,D33,0)","v":0.19966284139036147},{"$f":"Fishert(A33,B33,C33,D33,1)","v":0.86997952636583331},{"$f":"Fishert(A33,B33,C33,D33,2)","v":0.32968331502450965},{"$f":"Fishert(A33,B33,C33,D33,3)","v":0.50601934056012532}]
[9,6,7,13,35,{"$f":"Fishert(A34,B34,C34,D34,0)","v":9.5565120665472014E-2},{"$f":"Fishert(A34,B34,C34,D34,1)","v":0.96554464703130538},{"$f":"Fishert(A34,B34,C34,D34,2)","v":0.13002047363414829},{"$f":"Fishert(A34,B34,C34,D34,3)","v":0.18212184230465059}]
[10,5,6,14,35,{"$f":"Fishert(A35,B35,C35,D35,0)","v":2.8669536199641504E-2},{"$f":"Fishert(A35,B35,C35,D35,1)","v":0.9942141832309469},{"$f":"Fishert(A35,B35,C35,D35,2)","v":3.4455352968676245E-2},{"$f":"Fishert(A35,B35,C35,D35,3)","v":4.4203997707890019E-2}]
[11,4,5,15,35,{"$f":"Fishert(A36,B36,C36,D36,0)","v":5.2126429453893831E-3},{"$f":"Fishert(A36,B36,C36,D36,1)","v":0.99942682617633627},{"$f":"Fishert(A36,B36,C36,D36,2)","v":5.7858167690347335E-3},{"$f":"Fishert(A36,B36,C36,D36,3)","v":6.8467232659328893E-3}]
[12,3,4,16,35,{"$f":"Fishert(A37,B37,C37,D37,0)","v":5.429836401447261E-4},{"$f":"Fishert(A37,B37,C37,D37,1)","v":0.99996980981648098},{"$f":"Fishert(A37,B37,C37,D37,2)","v":5.7317382364535055E-4},{"$f":"Fishert(A37,B37,C37,D37,3)","v":6.3164898489170569E-4}]
[13,2,3,17,35,{"$f":"Fishert(A38,B38,C38,D38,0)","v":2.9483274577994255E-5},{"$f":"Fishert(A38,B38,C38,D38,1)","v":0.99999929309105895},{"$f":"Fishert(A38,B38,C38,D38,2)","v":3.0190183500624527E-5},{"$f":"Fishert(A38,B38,C38,D38,3)","v":3.1383554138305244E-5}]
[14,1,2,18,35,{"$f":"Fishert(A39,B39,C39,D39,0)","v":7.0198272804748375E-7},{"$f":"Fishert(A39,B39,C39,D39,1)","v":0.99999999507378701},{"$f":"Fishert(A39,B39,C39,D39,2)","v":7.0690892263027312E-7},{"$f":"Fishert(A39,B39,C39,D39,3)","v":7.0690892263027312E-7}]
[15,0,1,19,35,{"$f":"Fishert(A40,B40,C40,D40,0)","v":4.9261945827893416E-9},{"$f":"Fishert(A40,B40,C40,D40,1)","v":0.99999999999998157},{"$f":"Fishert(A40,B40,C40,D40,2)","v":4.9261945827893416E-9},{"$f":"Fishert(A40,B40,C40,D40,3)","v":4.9261945827893416E-9}]
[]
["a","b","c","d","N","F.P","Lower ac. p.","Upper ac. p.","F.Two-sided","Chi^2","Chi^2.Y"]
[0,10,10,0,{"$f":"SUM(A43:D43)","v":20},{"$f":"Fishert(A43,B43,C43,D43,0)","v":5.4125441122345402E-6},{"$f":"Fishert(A43,B43,C43,D43,1)","v":5.4125441122345402E-6},{"$f":"Fishert(A43,B43,C43,D43,2)","v":1.0000000000000102},{"$f":"Fishert(A43,B43,C43,D43,3)","v":1.082508822446908E-5},{"$f":"Chi(A43,B43,C43,D43,1)","v":7.7442164310440689E-6},{"$f":"chiY(A43,B43,C43,D43,1)","v":5.699411623331837E-5}]
[1,9,9,1,{"$f":"SUM(A44:D44)","v":20},{"$f":"Fishert(A44,B44,C44,D44,0)","v":5.4125441122345515E-4},{"$f":"Fishert(A44,B44,C44,D44,1)","v":5.4666695533568969E-4},{"$f":"Fishert(A44,B44,C44,D44,2)","v":0.99999458745589809},{"$f":"Fishert(A44,B44,C44,D44,3)","v":1.0933339106713796E-3},{"$f":"Chi(A44,B44,C44,D44,1)","v":3.466193511346668E-4},{"$f":"chiY(A44,B44,C44,D44,1)","v":1.7451186995289046E-3}]
[2,8,8,2,20,{"$f":"Fishert(A45,B45,C45,D45,0)","v":1.0960401827275E-2},{"$f":"Fishert(A45,B45,C45,D45,1)","v":1.150706878261069E-2},{"$f":"Fishert(A45,B45,C45,D45,2)","v":0.99945333304467465},{"$f":"Fishert(A45,B45,C45,D45,3)","v":2.301413756522136E-2},{"$f":"Chi(A45,B45,C45,D45,1)","v":7.2903580915356422E-3},{"$f":"chiY(A45,B45,C45,D45,1)","v":2.5347318677468252E-2}]
[3,7,7,3,20,{"$f":"Fishert(A46,B46,C46,D46,0)","v":7.7940635216177737E-2},{"$f":"Fishert(A46,B46,C46,D46,1)","v":8.944770399878843E-2},{"$f":"Fishert(A46,B46,C46,D46,2)","v":0.98849293121739967},{"$f":"Fishert(A46,B46,C46,D46,3)","v":0.17889540799757689},{"$f":"Chi(A46,B46,C46,D46,1)","v":7.3638270120302621E-2},{"$f":"chiY(A46,B46,C46,D46,1)","v":0.17971249487899987}]
[4,6,6,4,20,{"$f":"Fishert(A47,B47,C47,D47,0)","v":0.23869319534954439},{"$f":"Fishert(A47,B47,C47,D47,1)","v":0.32814089934833279},{"$f":"Fishert(A47,B47,C47,D47,2)","v":0.91055229600122189},{"$f":"Fishert(A47,B47,C47,D47,3)","v":0.65628179869666559},{"$f":"Chi(A47,B47,C47,D47,1)","v":0.37109336952269767},{"$f":"chiY(A47,B47,C47,D47,1)","v":0.65472084601857705}]
[5,5,5,5,20,{"$f":"Fishert(A48,B48,C48,D48,0)","v":0.34371820130334474},{"$f":"Fishert(A48,B48,C48,D48,1)","v":0.67185910065167753},{"$f":"Fishert(A48,B48,C48,D48,2)","v":0.67185910065167753},{"$f":"Fishert(A48,B48,C48,D48,3)","v":1.0000000000000102},{"$f":"Chi(A48,B48,C48,D48,1)","v":1},{"$f":"chiY(A48,B48,C48,D48,1)","v":0.65472084601857705}]
[6,4,4,6,20,{"$f":"Fishert(A49,B49,C49,D49,0)","v":0.23869319534954439},{"$f":"Fishert(A49,B49,C49,D49,1)","v":0.91055229600122189},{"$f":"Fishert(A49,B49,C49,D49,2)","v":0.32814089934833279},{"$f":"Fishert(A49,B49,C49,D49,3)","v":0.65628179869666559},{"$f":"Chi(A49,B49,C49,D49,1)","v":0.37109336952269767},{"$f":"chiY(A49,B49,C49,D49,1)","v":0.65472084601857705}]
[7,3,3,7,20,{"$f":"Fishert(A50,B50,C50,D50,0)","v":7.7940635216177764E-2},{"$f":"Fishert(A50,B50,C50,D50,1)","v":0.98849293121739967},{"$f":"Fishert(A50,B50,C50,D50,2)","v":8.944770399878843E-2},{"$f":"Fishert(A50,B50,C50,D50,3)","v":0.17889540799757689},{"$f":"Chi(A50,B50,C50,D50,1)","v":7.3638270120302621E-2},{"$f":"chiY(A50,B50,C50,D50,1)","v":0.17971249487899987}]
[8,2,2,8,20,{"$f":"Fishert(A51,B51,C51,D51,0)","v":1.0960401827274979E-2},{"$f":"Fishert(A51,B51,C51,D51,1)","v":0.99945333304467465},{"$f":"Fishert(A51,B51,C51,D51,2)","v":1.1507068782610669E-2},{"$f":"Fishert(A51,B51,C51,D51,3)","v":2.301413756522136E-2},{"$f":"Chi(A51,B51,C51,D51,1)","v":7.2903580915356422E-3},{"$f":"chiY(A51,B51,C51,D51,1)","v":2.5347318677468252E-2}]
[9,1,1,9,20,{"$f":"Fishert(A52,B52,C52,D52,0)","v":5.4125441122345515E-4},{"$f":"Fishert(A52,B52,C52,D52,1)","v":0.99999458745589809},{"$f":"Fishert(A52,B52,C52,D52,2)","v":5.4666695533568969E-4},{"$f":"Fishert(A52,B52,C52,D52,3)","v":1.0933339106713796E-3},{"$f":"Chi(A52,B52,C52,D52,1)","v":3.466193511346668E-4},{"$f":"chiY(A52,B52,C52,D52,1)","v":1.7451186995289046E-3}]
[10,0,0,10,20,{"$f":"Fishert(A53,B53,C53,D53,0)","v":5.4125441122345402E-6},{"$f":"Fishert(A53,B53,C53,D53,1)","v":1.0000000000000102},{"$f":"Fishert(A53,B53,C53,D53,2)","v":5.4125441122345402E-6},{"$f":"Fishert(A53,B53,C53,D53,3)","v":1.082508822446908E-5},{"$f":"Chi(A53,B53,C53,D53,1)","v":7.7442164310440689E-6},{"$f":"chiY(A53,B53,C53,D53,1)","v":5.699411623331837E-5}]
[]
[]
[]
[]
[]
[]
[]
[]
[]
[]
[]
[]
["Word","a","b","c","d","N","F.P","Lower ac. p.","Upper ac. p.","F.Two-sided","Chi^2","Chi^2.Y"]
["w1",10,10,10,10,{"$f":"SUM(B67:E67)","v":40},{"$f":"Fishert(B67,C67,D67,E67,0)","v":0.24762886543608525},{"$f":"Fishert(B67,C67,D67,E67,1)","v":0.62381443271803483},{"$f":"Fishert(B67,C67,D67,E67,2)","v":0.62381443271803494},{"$f":"Fishert(B67,C67,D67,E67,3)","v":0.99999999999998446},{"$f":"Chi(B67,C67,D67,E67,1)","v":1},{"$f":"chiY(B67,C67,D67,E67,1)","v":0.75182963404584924}]
["w2",12,10,10,10,{"$f":"SUM(B68:E68)","v":42},{"$f":"Fishert(B68,C68,D68,E68,0)","v":0.23252954437291451},{"$f":"Fishert(B68,C68,D68,E68,1)","v":0.72676434905788501},{"$f":"Fishert(B68,C68,D68,E68,2)","v":0.50576519531503172},{"$f":"Fishert(B68,C68,D68,E68,3)","v":1.0000000000000022},{"$f":"Chi(B68,C68,D68,E68,1)","v":0.76831541253506108},{"$f":"chiY(B68,C68,D68,E68,1)","v":0.98824841820871034}]
["w3",14,10,10,10,44,{"$f":"Fishert(B69,C69,D69,E69,0)","v":0.20576133833784066},{"$f":"Fishert(B69,C69,D69,E69,1)","v":0.80408421765063798},{"$f":"Fishert(B69,C69,D69,E69,2)","v":0.40167712068721989},{"$f":"Fishert(B69,C69,D69,E69,3)","v":0.76192903002234835},{"$f":"Chi(B69,C69,D69,E69,1)","v":0.58042036679592046},{"$f":"chiY(B69,C69,D69,E69,1)","v":0.80355659932567458}]
["w4",16,10,10,10,46,{"$f":"Fishert(B70,C70,D70,E70,0)","v":0.17498825573216101},{"$f":"Fishert(B70,C70,D70,E70,1)","v":0.86045321553263687},{"$f":"Fishert(B70,C70,D70,E70,2)","v":0.3145350401995341},{"$f":"Fishert(B70,C70,D70,E70,3)","v":0.55168298118207815},{"$f":"Chi(B70,C70,D70,E70,1)","v":0.4338758244448207},{"$f":"chiY(B70,C70,D70,E70,1)","v":0.6293876875257558}]
["w5",18,10,10,10,48,{"$f":"Fishert(B71,C71,D71,E71,0)","v":0.14487450709239644},{"$f":"Fishert(B71,C71,D71,E71,1)","v":0.90083301484505207},{"$f":"Fishert(B71,C71,D71,E71,2)","v":0.24404149224735772},{"$f":"Fishert(B71,C71,D71,E71,3)","v":0.38206584176573838},{"$f":"Chi(B71,C71,D71,E71,1)","v":0.3222995958719192},{"$f":"chiY(B71,C71,D71,E71,1)","v":0.48842231662259361}]
["w6",20,10,10,10,50,{"$f":"Fishert(B72,C72,D72,E72,0)","v":0.11778250743097284},{"$f":"Fishert(B72,C72,D72,E72,1)","v":0.92948113166107649},{"$f":"Fishert(B72,C72,D72,E72,2)","v":0.18830137576991929},{"$f":"Fishert(B72,C72,D72,E72,3)","v":0.25754924281098823},{"$f":"Chi(B72,C72,D72,E72,1)","v":0.23859282931643541},{"$f":"chiY(B72,C72,D72,E72,1)","v":0.37675911781158195}]
["w7",22,10,10,10,52,{"$f":"Fishert(B73,C73,D73,E73,0)","v":9.4599457236025697E-2},{"$f":"Fishert(B73,C73,D73,E73,1)","v":0.94971679290687228},{"$f":"Fishert(B73,C73,D73,E73,2)","v":0.14488266432917543},{"$f":"Fishert(B73,C73,D73,E73,3)","v":0.24349694398330529},{"$f":"Chi(B73,C73,D73,E73,1)","v":0.17634917175391537},{"$f":"chiY(B73,C73,D73,E73,1)","v":0.28954026608881844}]
["w8",24,10,10,10,54,{"$f":"Fishert(B74,C74,D74,E74,0)","v":7.5381652084735629E-2},{"$f":"Fishert(B74,C74,D74,E74,1)","v":0.96399811193403928},{"$f":"Fishert(B74,C74,D74,E74,2)","v":0.11138354015070706},{"$f":"Fishert(B74,C74,D74,E74,3)","v":0.154309210733269},{"$f":"Chi(B74,C74,D74,E74,1)","v":0.13029994664459418},{"$f":"chiY(B74,C74,D74,E74,1)","v":0.22203200221077263}]
["w9",26,10,10,10,56,{"$f":"Fishert(B75,C75,D75,E75,0)","v":5.977817724761525E-2},{"$f":"Fishert(B75,C75,D75,E75,1)","v":0.97409292758034516},{"$f":"Fishert(B75,C75,D75,E75,2)","v":8.5685249667273991E-2},{"$f":"Fishert(B75,C75,D75,E75,3)","v":0.14565279895235103},{"$f":"Chi(B75,C75,D75,E75,1)","v":9.6320675162193004E-2},{"$f":"chiY(B75,C75,D75,E75,1)","v":0.17008179251033512}]
["w10",28,10,10,10,58,{"$f":"Fishert(B76,C76,D76,E76,0)","v":4.7281219010757394E-2},{"$f":"Fishert(B76,C76,D76,E76,1)","v":0.98125147226992637},{"$f":"Fishert(B76,C76,D76,E76,2)","v":6.6029746740862594E-2},{"$f":"Fishert(B76,C76,D76,E76,3)","v":8.7646057987381024E-2},{"$f":"Chi(B76,C76,D76,E76,1)","v":7.1272744570623048E-2},{"$f":"chiY(B76,C76,D76,E76,1)","v":0.13024565852391465}]
["3*3"]
["A:B","B1","B2","B3"]
["A1",1,2,3]
["A2",4,5,6]
["A3",7,8,9]
["↓"]
["A1","B1","B2","B3"]
["a",{"$f":"B79","v":1},{"$f":"C79","v":2},{"$f":"D79","v":3}]
["b",{"$f":"C79+D79","v":5},{"$f":"B79+D79","v":4},{"$f":"B79+C79","v":3}]
["c",{"$f":"B80+B81","v":11},{"$f":"C80+C81","v":13},{"$f":"D80+D81","v":15}]
["d",{"$f":"SUM(C80:D81)","v":28},{"$f":"SUM(B80:B81,D80:D81)","v":26},{"$f":"SUM(B80:C81)","v":24},{"$f":"Fishert(B84,B85,B86,B87,2)","v":0.8640196634524665},{"$f":"Fishert(C84,C85,C86,C87,2)","v":0.66465992884031821},{"$f":"Fishert(D84,D85,D86,D87,2)","v":0.45558412092729172}]
["A2","B1","B2","B3"]
["a",{"$f":"B80","v":4},{"$f":"C80","v":5},{"$f":"D80","v":6}]
["b",{"$f":"SUM(C80:D80)","v":11},{"$f":"SUM(B80,D80)","v":10},{"$f":"SUM(B80:C80)","v":9}]
["c",{"$f":"SUM(B79,B81)","v":8},{"$f":"SUM(C79,C81)","v":10},{"$f":"SUM(D79,D81)","v":12}]
["d",{"$f":"SUM(C79:D79,C81:D81)","v":22},{"$f":"SUM(B79,D79,B81,D81)","v":20},{"$f":"SUM(B79:C79,B81,C81)","v":18},{"$f":"Fishert(B89,B90,B91,B92,2)","v":0.63246263706885497},{"$f":"Fishert(C89,C90,C91,C92,2)","v":0.62643058110857486},{"$f":"Fishert(D89,D90,D91,D92,2)","v":0.62359265656889784}]
["A3","B1","B2","B3"]
["a",{"$f":"B81","v":7},{"$f":"C81","v":8},{"$f":"D81","v":9}]
["b",{"$f":"SUM(C81:D81)","v":17},{"$f":"SUM(B81,D81)","v":16},{"$f":"SUM(B81:C81)","v":15}]
["c",{"$f":"SUM(B79:B80)","v":5},{"$f":"SUM(C79:C80)","v":7},{"$f":"SUM(D79:D80)","v":9}]
["d",{"$f":"SUM(C79:D80)","v":16},{"$f":"SUM(B79:B80,D79:D80)","v":14},{"$f":"SUM(B79:C80)","v":12},{"$f":"Fishert(B94,B95,B96,B97,2)","v":0.47463912273896597},{"$f":"Fishert(C94,C95,C96,C97,2)","v":0.62482908136394466},{"$f":"Fishert(D94,D95,D96,D97,2)","v":0.74878790902236636}]
[]
["Fisher","B1","B2","B3"]
["A1",{"$f":"E87","v":0.8640196634524665},{"$f":"F87","v":0.66465992884031821},0.45558412092729172]
["A2",{"$f":"E92","v":0.63246263706885497},{"$f":"F92","v":0.62643058110857486},0.62359265656889784]
["A3",{"$f":"E97","v":0.47463912273896597},{"$f":"F97","v":0.62482908136394466},0.74878790902236636]

{"sheet":"Yates","index":12,"n_rows":38,"n_cols":28,"rows_kept":38,"cut":false,"hidden":false,"merged":[[13,19,13,20],[13,14,13,15],[26,19,26,20],[26,14,26,15],[0,14,0,15]]}
[null,"周辺度数を固定",null,null,null,null,null,null,null,null,"Expect.",null,null,null,"(o-e)^2/e"]
["Word","a","b","c","d","a+b","c+d","a+c","b+d","N","E.a","E.b","E.c","E.d","Chi^2.a","Chi^2.b","Chi^2.c","Chi^2.d","chi^2","Chi.P","Chi.Y.P","Fis.P"]
["w1",10,{"$f":"F3-B3","v":10},{"$f":"H3-B3","v":10},{"$f":"I3-C3","v":10},20,20,20,20,{"$f":"SUM(B3:E3)","v":40},{"$f":"F3*H3/J3","v":10},{"$f":"F3*I3/J3","v":10},{"$f":"G3*H3/J3","v":10},{"$f":"G3*I3/J3","v":10},{"$f":"(B3-K3)^2/K3","v":0},{"$f":"(C3-L3)^2/L3","v":0},{"$f":"(D3-M3)^2/M3","v":0},{"$f":"(E3-N3)^2/N3","v":0},{"$f":"SUM(O3:R3)","v":0},{"$f":"Chi(B3,C3,D3,E3,1)","v":1},{"$f":"chiY(B3,C3,D3,E3,1)","v":0.75182963404584924},{"$f":"Fishert(B3,C3,D3,E3,3)","v":0.99999999999998446}]
["w2",11,{"$f":"F4-B4","v":9},{"$f":"H4-B4","v":9},{"$f":"I4-C4","v":11},20,20,20,20,{"$f":"SUM(B4:E4)","v":40},10,10,10,10,0.1,0.1,0.1,0.1,{"$f":"SUM(O4:R4)","v":0.4},{"$f":"Chi(B4,C4,D4,E4,1)","v":0.52708925686553809},{"$f":"chiY(B4,C4,D4,E4,1)","v":0.75182963404584924},{"$f":"Fishert(B4,C4,D4,E4,3)","v":0.75237113456389915}]
["w3",12,8,8,12,20,20,20,20,40,10,10,10,10,0.4,0.4,0.4,0.4,{"$f":"SUM(O5:R5)","v":1.6},{"$f":"Chi(B5,C5,D5,E5,1)","v":0.20590321073206833},{"$f":"chiY(B5,C5,D5,E5,1)","v":0.34278171114791145},{"$f":"Fishert(B5,C5,D5,E5,3)","v":0.34306722475218432}]
["w4",13,7,7,13,20,20,20,20,40,10,10,10,10,0.9,0.9,0.9,0.9,3.6,{"$f":"Chi(B6,C6,D6,E6,1)","v":5.7779571123597238E-2},{"$f":"chiY(B6,C6,D6,E6,1)","v":0.11384629800665802},{"$f":"Fishert(B6,C6,D6,E6,3)","v":0.11283377548309446}]
["w5",14,6,6,14,20,20,20,20,40,10,10,10,10,1.6,1.6,1.6,1.6,6.4,{"$f":"Chi(B7,C7,D7,E7,1)","v":1.1412036386001658E-2},{"$f":"chiY(B7,C7,D7,E7,1)","v":2.6856695507524415E-2},{"$f":"Fishert(B7,C7,D7,E7,3)","v":2.5644776943320884E-2}]
["w6",15,5,5,15,20,20,20,20,40,10,10,10,10,2.5,2.5,2.5,2.5,10,{"$f":"Chi(B8,C8,D8,E8,1)","v":1.5654022580025477E-3},{"$f":"chiY(B8,C8,D8,E8,1)","v":4.4265258579198321E-3},{"$f":"Fishert(B8,C8,D8,E8,3)","v":3.8475273083774788E-3}]
["w7",16,4,4,16,20,20,20,20,40,10,10,10,10,3.6,3.6,3.6,3.6,14.4,{"$f":"Chi(B9,C9,D9,E9,1)","v":1.4780231033445414E-4},{"$f":"chiY(B9,C9,D9,E9,1)","v":5.0421822944900674E-4},{"$f":"Fishert(B9,C9,D9,E9,3)","v":3.5996736678653207E-4}]
["w8",17,3,3,17,20,20,20,20,40,10,10,10,10,4.9000000000000004,4.9000000000000004,4.9000000000000004,4.9000000000000004,19.600000000000001,{"$f":"Chi(B10,C10,D10,E10,1)","v":9.5469198452381424E-6},{"$f":"chiY(B10,C10,D10,E10,1)","v":3.9401582725131879E-5},{"$f":"Fishert(B10,C10,D10,E10,3)","v":1.9385341240542437E-5}]
["w9",18,2,2,18,20,20,20,20,40,10,10,10,10,6.4,6.4,6.4,6.4,25.6,{"$f":"Chi(B11,C11,D11,E11,1)","v":4.2003939760220139E-7},{"$f":"chiY(B11,C11,D11,E11,1)","v":2.1014359560124369E-6},{"$f":"Fishert(B11,C11,D11,E11,3)","v":5.2958896117961382E-7}]
["w10",19,1,1,19,20,20,20,20,40,10,10,10,10,8.1,8.1,8.1,8.1,32.4,{"$f":"Chi(B12,C12,D12,E12,1)","v":1.2548647497615145E-8},{"$f":"chiY(B12,C12,D12,E12,1)","v":7.6212912963829586E-8},{"$f":"Fishert(B12,C12,D12,E12,3)","v":5.8180645306436629E-9}]
[]
[null,"周辺度数を固定",null,null,null,null,null,null,null,null,"Expect.",null,null,null,"(o-e)^2/e",null,null,null,null,"|o-e-.5|^2/e.Y"]
["Word","a","b","c","d","a+b","c+d","a+c","b+d","N","E.a","E.b","E.c","E.d","Chi^2.a","Chi^2.b","Chi^2.c","Chi^2.d","chi^2","Chi^2.Y.a","Chi^2.Y.b","Chi^2.Y.c","Chi^2.Y.d","Chi^2.Y","Chi.P","Chi.Y.P","Fis.P.one","Fis.P.two"]
["w1",10,{"$f":"F16-B16","v":10},{"$f":"H16-B16","v":10},{"$f":"I16-C16","v":10},20,20,20,20,{"$f":"SUM(B16:E16)","v":40},{"$f":"F16*H16/J16","v":10},{"$f":"F16*I16/J16","v":10},{"$f":"G16*H16/J16","v":10},{"$f":"G16*I16/J16","v":10},{"$f":"(B16-K16)^2/K16","v":0},{"$f":"(C16-L16)^2/L16","v":0},{"$f":"(D16-M16)^2/M16","v":0},{"$f":"(E16-N16)^2/N16","v":0},{"$f":"SUM(O16:R16)","v":0},{"$f":"(ABS(B16-K16)-0.5)^2/K16","v":2.5000000000000001E-2},{"$f":"(ABS(C16-L16)-0.5)^2/L16","v":2.5000000000000001E-2},{"$f":"(ABS(D16-M16)-0.5)^2/M16","v":2.5000000000000001E-2},{"$f":"(ABS(E16-N16)-0.5)^2/N16","v":2.5000000000000001E-2},{"$f":"SUM(T16:W16)","v":0.1},{"$f":"Chi(B16,C16,D16,E16,1)","v":1},{"$f":"chiY(B16,C16,D16,E16,1)","v":0.75182963404584924},{"$f":"Fishert(B16,C16,D16,E16,2)","v":0.62381443271803494},{"$f":"Fishert(B16,C16,D16,E16,3)","v":0.99999999999998446}]
["w2",11,{"$f":"F17-B17","v":9},{"$f":"H17-B17","v":9},{"$f":"I17-C17","v":11},20,20,20,20,{"$f":"SUM(B17:E17)","v":40},10,10,10,10,0.1,0.1,0.1,0.1,{"$f":"SUM(O17:R17)","v":0.4},2.5000000000000001E-2,2.5000000000000001E-2,2.5000000000000001E-2,2.5000000000000001E-2,{"$f":"SUM(T17:W17)","v":0.1},{"$f":"Chi(B17,C17,D17,E17,1)","v":0.52708925686553809},{"$f":"chiY(B17,C17,D17,E17,1)","v":0.75182963404584924},{"$f":"Fishert(B17,C17,D17,E17,2)","v":0.37618556728194968},{"$f":"Fishert(B17,C17,D17,E17,3)","v":0.75237113456389915}]
["w3",12,8,8,12,20,20,20,20,40,10,10,10,10,0.4,0.4,0.4,0.4,{"$f":"SUM(O18:R18)","v":1.6},0.22500000000000001,0.22500000000000001,0.22500000000000001,0.22500000000000001,0.9,{"$f":"Chi(B18,C18,D18,E18,1)","v":0.20590321073206833},{"$f":"chiY(B18,C18,D18,E18,1)","v":0.34278171114791145},{"$f":"Fishert(B18,C18,D18,E18,2)","v":0.17153361237609227},{"$f":"Fishert(B18,C18,D18,E18,3)","v":0.34306722475218432}]
["w4",13,7,7,13,20,20,20,20,40,10,10,10,10,0.9,0.9,0.9,0.9,3.6,0.625,0.625,0.625,0.625,2.5,{"$f":"Chi(B19,C19,D19,E19,1)","v":5.7779571123597238E-2},{"$f":"chiY(B19,C19,D19,E19,1)","v":0.11384629800665802},{"$f":"Fishert(B19,C19,D19,E19,2)","v":5.6416887741547225E-2},{"$f":"Fishert(B19,C19,D19,E19,3)","v":0.11283377548309446}]
["w5",14,6,6,14,20,20,20,20,40,10,10,10,10,1.6,1.6,1.6,1.6,6.4,1.2250000000000001,1.2250000000000001,1.2250000000000001,1.2250000000000001,4.9000000000000004,{"$f":"Chi(B20,C20,D20,E20,1)","v":1.1412036386001658E-2},{"$f":"chiY(B20,C20,D20,E20,1)","v":2.6856695507524415E-2},{"$f":"Fishert(B20,C20,D20,E20,2)","v":1.2822388471660437E-2},{"$f":"Fishert(B20,C20,D20,E20,3)","v":2.5644776943320884E-2}]
["w6",15,5,5,15,20,20,20,20,40,10,10,10,10,2.5,2.5,2.5,2.5,10,2.0249999999999999,2.0249999999999999,2.0249999999999999,2.0249999999999999,8.1,{"$f":"Chi(B21,C21,D21,E21,1)","v":1.5654022580025477E-3},{"$f":"chiY(B21,C21,D21,E21,1)","v":4.4265258579198321E-3},{"$f":"Fishert(B21,C21,D21,E21,2)","v":1.9237636541887407E-3},{"$f":"Fishert(B21,C21,D21,E21,3)","v":3.8475273083774788E-3}]
["w7",16,4,4,16,20,20,20,20,40,10,10,10,10,3.6,3.6,3.6,3.6,14.4,3.0249999999999999,3.0249999999999999,3.0249999999999999,3.0249999999999999,12.1,{"$f":"Chi(B22,C22,D22,E22,1)","v":1.4780231033445414E-4},{"$f":"chiY(B22,C22,D22,E22,1)","v":5.0421822944900674E-4},{"$f":"Fishert(B22,C22,D22,E22,2)","v":1.7998368339326633E-4},{"$f":"Fishert(B22,C22,D22,E22,3)","v":3.5996736678653207E-4}]
["w8",17,3,3,17,20,20,20,20,40,10,10,10,10,4.9000000000000004,4.9000000000000004,4.9000000000000004,4.9000000000000004,19.600000000000001,4.2249999999999996,4.2249999999999996,4.2249999999999996,4.2249999999999996,16.899999999999999,{"$f":"Chi(B23,C23,D23,E23,1)","v":9.5469198452381424E-6},{"$f":"chiY(B23,C23,D23,E23,1)","v":3.9401582725131879E-5},{"$f":"Fishert(B23,C23,D23,E23,2)","v":9.6926706202712167E-6},{"$f":"Fishert(B23,C23,D23,E23,3)","v":1.9385341240542437E-5}]
["w9",18,2,2,18,20,20,20,20,40,10,10,10,10,6.4,6.4,6.4,6.4,25.6,5.625,5.625,5.625,5.625,22.5,{"$f":"Chi(B24,C24,D24,E24,1)","v":4.2003939760220139E-7},{"$f":"chiY(B24,C24,D24,E24,1)","v":2.1014359560124369E-6},{"$f":"Fishert(B24,C24,D24,E24,2)","v":2.6479448058980755E-7},{"$f":"Fishert(B24,C24,D24,E24,3)","v":5.2958896117961382E-7}]
["w10",19,1,1,19,20,20,20,20,40,10,10,10,10,8.1,8.1,8.1,8.1,32.4,7.2249999999999996,7.2249999999999996,7.2249999999999996,7.2249999999999996,28.9,{"$f":"Chi(B25,C25,D25,E25,1)","v":1.2548647497615145E-8},{"$f":"chiY(B25,C25,D25,E25,1)","v":7.6212912963829586E-8},{"$f":"Fishert(B25,C25,D25,E25,2)","v":2.909032265321831E-9},{"$f":"Fishert(B25,C25,D25,E25,3)","v":5.8180645306436629E-9}]
[]
[null,"周辺度数を自由に",null,null,null,null,null,null,null,null,"Expect.",null,null,null,"(o-e)^2/e",null,null,null,null,"|o-e-.5|^2/e.Y"]
["Word","a","b","c","d","a+b","c+d","a+c","b+d","N","E.a","E.b","E.c","E.d","Chi^2.a","Chi^2.b","Chi^2.c","Chi^2.d","chi^2","Chi^2.Y.a","Chi^2.Y.b","Chi^2.Y.c","Chi^2.Y.d","Chi^2.Y","Chi.P","Chi.Y.P","Fis.P.one","Fis.P.two"]
["w1",10,10,10,10,{"$f":"B29+C29","v":20},{"$f":"D29+E29","v":20},{"$f":"B29+D29","v":20},{"$f":"C29+E29","v":20},{"$f":"SUM(B29:E29)","v":40},{"$f":"F29*H29/J29","v":10},{"$f":"F29*I29/J29","v":10},{"$f":"G29*H29/J29","v":10},{"$f":"G29*I29/J29","v":10},{"$f":"(B29-K29)^2/K29","v":0},{"$f":"(C29-L29)^2/L29","v":0},{"$f":"(D29-M29)^2/M29","v":0},{"$f":"(E29-N29)^2/N29","v":0},{"$f":"SUM(O29:R29)","v":0},{"$f":"(ABS(B29-K29)-0.5)^2/K29","v":2.5000000000000001E-2},{"$f":"(ABS(C29-L29)-0.5)^2/L29","v":2.5000000000000001E-2},{"$f":"(ABS(D29-M29)-0.5)^2/M29","v":2.5000000000000001E-2},{"$f":"(ABS(E29-N29)-0.5)^2/N29","v":2.5000000000000001E-2},{"$f":"SUM(T29:W29)","v":0.1},{"$f":"Chi(B29,C29,D29,E29,1)","v":1},{"$f":"chiY(B29,C29,D29,E29,1)","v":0.75182963404584924},{"$f":"Fishert(B29,C29,D29,E29,2)","v":0.62381443271803494},{"$f":"Fishert(B29,C29,D29,E29,3)","v":0.99999999999998446}]
["w2",12,10,10,10,{"$f":"B30+C30","v":22},{"$f":"D30+E30","v":20},{"$f":"B30+D30","v":22},{"$f":"C30+E30","v":20},{"$f":"SUM(B30:E30)","v":42},11.523809523809524,10.476190476190476,10.476190476190476,9.5238095238095237,1.9677292404565137E-2,2.1645021645021651E-2,2.1645021645021651E-2,2.3809523809523815E-2,{"$f":"SUM(O30:R30)","v":8.6776859504132248E-2},{"$f":"(ABS(B30-K30)-0.5)^2/K30","v":4.9193231011412481E-5},5.4112554112553733E-5,5.4112554112553733E-5,5.9523809523809104E-5,{"$f":"SUM(T30:W30)","v":2.1694214876032906E-4},{"$f":"Chi(B30,C30,D30,E30,1)","v":0.76831541253506108},{"$f":"chiY(B30,C30,D30,E30,1)","v":0.98824841820871034},{"$f":"Fishert(B30,C30,D30,E30,2)","v":0.50576519531503172},{"$f":"Fishert(B30,C30,D30,E30,3)","v":1.0000000000000022}]
["w3",14,10,10,10,24,20,24,20,44,13.090909090909092,10.909090909090908,10.909090909090908,9.0909090909090917,6.3131313131313024E-2,7.5757575757575635E-2,7.5757575757575635E-2,9.0909090909090745E-2,{"$f":"SUM(O31:R31)","v":0.30555555555555503},1.2784090909090858E-2,1.534090909090903E-2,1.534090909090903E-2,1.8409090909090833E-2,6.187499999999975E-2,{"$f":"Chi(B31,C31,D31,E31,1)","v":0.58042036679592046},{"$f":"chiY(B31,C31,D31,E31,1)","v":0.80355659932567458},{"$f":"Fishert(B31,C31,D31,E31,2)","v":0.40167712068721989},{"$f":"Fishert(B31,C31,D31,E31,3)","v":0.76192903002234835}]
["w4",16,10,10,10,26,20,26,20,46,14.695652173913043,11.304347826086957,11.304347826086957,8.695652173913043,0.11577051710830984,0.15050167224080277,0.15050167224080277,0.19565217391304363,{"$f":"SUM(O32:R32)","v":0.61242603550295893},4.4024954978132289E-2,5.7232441471571971E-2,5.7232441471571971E-2,7.4402173913043573E-2,0.23289201183431982,{"$f":"Chi(B32,C32,D32,E32,1)","v":0.4338758244448207},{"$f":"chiY(B32,C32,D32,E32,1)","v":0.6293876875257558},{"$f":"Fishert(B32,C32,D32,E32,2)","v":0.3145350401995341},{"$f":"Fishert(B32,C32,D32,E32,3)","v":0.55168298118207815}]
["w5",18,10,10,10,28,20,28,20,48,16.333333333333332,11.666666666666666,11.666666666666666,8.3333333333333339,0.1700680272108846,0.23809523809523794,0.23809523809523794,0.33333333333333309,0.97959183673469363,8.3333333333333509E-2,0.11666666666666656,0.11666666666666656,0.16333333333333316,0.47999999999999982,{"$f":"Chi(B33,C33,D33,E33,1)","v":0.3222995958719192},{"$f":"chiY(B33,C33,D33,E33,1)","v":0.48842231662259361},{"$f":"Fishert(B33,C33,D33,E33,2)","v":0.24404149224735772},{"$f":"Fishert(B33,C33,D33,E33,3)","v":0.38206584176573838}]
["w6",20,10,10,10,30,20,30,20,50,18,12,12,8,0.22222222222222221,0.33333333333333331,0.33333333333333331,0.5,1.3888888888888888,0.125,0.1875,0.1875,0.28125,0.78125,{"$f":"Chi(B34,C34,D34,E34,1)","v":0.23859282931643541},{"$f":"chiY(B34,C34,D34,E34,1)","v":0.37675911781158195},{"$f":"Fishert(B34,C34,D34,E34,2)","v":0.18830137576991929},{"$f":"Fishert(B34,C34,D34,E34,3)","v":0.25754924281098823}]
["w7",22,10,10,10,32,20,32,20,52,19.692307692307693,12.307692307692308,12.307692307692308,7.6923076923076925,0.27043269230769207,0.43269230769230793,0.43269230769230793,0.69230769230769218,1.828125,0.1659405048076921,0.26550480769230789,0.26550480769230789,0.42480769230769222,1.1217578125000001,{"$f":"Chi(B35,C35,D35,E35,1)","v":0.17634917175391537},{"$f":"chiY(B35,C35,D35,E35,1)","v":0.28954026608881844},{"$f":"Fishert(B35,C35,D35,E35,2)","v":0.14488266432917543},{"$f":"Fishert(B35,C35,D35,E35,3)","v":0.24349694398330529}]
["w8",24,10,10,10,34,20,34,20,54,21.407407407407408,12.592592592592593,12.592592592592593,7.4074074074074074,0.31398180187107499,0.53376906318082828,0.53376906318082828,0.90740740740740733,2.2889273356401389,0.2045527361271304,0.34773965141612229,0.34773965141612229,0.5911574074074073,1.4911894463667823,{"$f":"Chi(B36,C36,D36,E36,1)","v":0.13029994664459418},{"$f":"chiY(B36,C36,D36,E36,1)","v":0.22203200221077263},{"$f":"Fishert(B36,C36,D36,E36,2)","v":0.11138354015070706},{"$f":"Fishert(B36,C36,D36,E36,3)","v":0.154309210733269}]
["w9",26,10,10,10,36,20,36,20,56,23.142857142857142,12.857142857142858,12.857142857142858,7.1428571428571432,0.35273368606701955,0.63492063492063522,0.63492063492063522,1.1428571428571426,2.7654320987654328,0.2400793650793652,0.43214285714285733,0.43214285714285733,0.77785714285714247,1.8822222222222225,{"$f":"Chi(B37,C37,D37,E37,1)","v":9.6320675162193004E-2},{"$f":"chiY(B37,C37,D37,E37,1)","v":0.17008179251033512},{"$f":"Fishert(B37,C37,D37,E37,2)","v":8.5685249667273991E-2},{"$f":"Fishert(B37,C37,D37,E37,3)","v":0.14565279895235103}]
["w10",28,10,10,10,38,20,38,20,58,24.896551724137932,13.103448275862069,13.103448275862069,6.8965517241379306,0.38685643327920494,0.73502722323049019,0.73502722323049019,1.3965517241379315,3.2534626038781167,0.27224424491355403,0.51726406533575331,0.51726406533575331,0.98280172413793143,2.2895740997229921,{"$f":"Chi(B38,C38,D38,E38,1)","v":7.1272744570623048E-2},{"$f":"chiY(B38,C38,D38,E38,1)","v":0.13024565852391465},{"$f":"Fishert(B38,C38,D38,E38,2)","v":6.6029746740862594E-2},{"$f":"Fishert(B38,C38,D38,E38,3)","v":8.7646057987381024E-2}]

{"sheet":"Yates(2)","index":13,"n_rows":17,"n_cols":28,"rows_kept":17,"cut":false,"hidden":false,"merged":[[0,14,0,15],[0,19,0,20],[9,14,9,15],[9,19,9,20]]}
[null,"周辺度数を固定",null,null,null,null,null,null,null,null,"Expect.",null,null,null,"(o-e)^2/e",null,null,null,null,"|o-e-.5|^2/e.Y"]
["Word","a","b","c","d","a+b","c+d","a+c","b+d","N","E.a","E.b","E.c","E.d","Chi^2.a","Chi^2.b","Chi^2.c","Chi^2.d","chi^2","Chi^2.Y.a","Chi^2.Y.b","Chi^2.Y.c","Chi^2.Y.d","Chi^2.Y","Chi.P","Chi.Y.P","Fis.P.one","Fis.P.two"]
["w1",5,5,5,5,10,10,10,10,{"$f":"SUM(B3:E3)","v":20},{"$f":"F3*H3/J3","v":5},{"$f":"F3*I3/J3","v":5},{"$f":"G3*H3/J3","v":5},{"$f":"G3*I3/J3","v":5},{"$f":"(B3-K3)^2/K3","v":0},0,0,0,{"$f":"SUM(O3:R3)","v":0},{"$f":"(ABS(B3-K3)-0.5)^2/K3","v":0.05},0.05,0.05,0.05,{"$f":"SUM(T3:W3)","v":0.2},{"$f":"Chi(B3,C3,D3,E3,1)","v":1},{"$f":"chiY(B3,C3,D3,E3,1)","v":0.65472084601857705},{"$f":"Fishert(B3,C3,D3,E3,2)","v":0.67185910065167753},{"$f":"Fishert(B3,C3,D3,E3,3)","v":1.0000000000000102}]
["w2",6,4,4,6,10,10,10,10,20,5,5,5,5,0.2,0.2,0.2,0.2,0.8,0.05,0.05,0.05,0.05,0.2,{"$f":"Chi(B4,C4,D4,E4,1)","v":0.37109336952269767},{"$f":"chiY(B4,C4,D4,E4,1)","v":0.65472084601857705},{"$f":"Fishert(B4,C4,D4,E4,2)","v":0.32814089934833279},{"$f":"Fishert(B4,C4,D4,E4,3)","v":0.65628179869666559}]
["w3",7,3,3,7,10,10,10,10,20,5,5,5,5,0.8,0.8,0.8,0.8,3.2,0.45,0.45,0.45,0.45,1.8,{"$f":"Chi(B5,C5,D5,E5,1)","v":7.3638270120302621E-2},{"$f":"chiY(B5,C5,D5,E5,1)","v":0.17971249487899987},{"$f":"Fishert(B5,C5,D5,E5,2)","v":8.944770399878843E-2},{"$f":"Fishert(B5,C5,D5,E5,3)","v":0.17889540799757689}]
["w4",8,2,2,8,10,10,10,10,20,5,5,5,5,1.8,1.8,1.8,1.8,7.2,1.25,1.25,1.25,1.25,5,{"$f":"Chi(B6,C6,D6,E6,1)","v":7.2903580915356422E-3},{"$f":"chiY(B6,C6,D6,E6,1)","v":2.5347318677468252E-2},{"$f":"Fishert(B6,C6,D6,E6,2)","v":1.1507068782610669E-2},{"$f":"Fishert(B6,C6,D6,E6,3)","v":2.301413756522136E-2}]
["w5",9,1,1,9,10,10,10,10,20,5,5,5,5,3.2,3.2,3.2,3.2,12.8,2.4500000000000002,2.4500000000000002,2.4500000000000002,2.4500000000000002,9.8000000000000007,{"$f":"Chi(B7,C7,D7,E7,1)","v":3.466193511346668E-4},{"$f":"chiY(B7,C7,D7,E7,1)","v":1.7451186995289046E-3},{"$f":"Fishert(B7,C7,D7,E7,2)","v":5.4666695533568969E-4},{"$f":"Fishert(B7,C7,D7,E7,3)","v":1.0933339106713796E-3}]
["w6",10,5,0,10,10,10,10,10,25,4,4,4,4,9,0.25,4,9,22.25,7.5625,6.25E-2,3.0625,7.5625,18.25,{"$f":"Chi(B8,C8,D8,E8,1)","v":8.5812066639367405E-4},{"$f":"chiY(B8,C8,D8,E8,1)","v":3.5379364782221032E-3},{"$f":"Fishert(B8,C8,D8,E8,2)","v":9.186969982501016E-4},{"$f":"Fishert(B8,C8,D8,E8,3)","v":9.6489188560799888E-4}]
[]
[null,"周辺度数を自由に",null,null,null,null,null,null,null,null,"Expect.",null,null,null,"(o-e)^2/e",null,null,null,null,"|o-e-.5|^2/e.Y"]
["Word","a","b","c","d","a+b","c+d","a+c","b+d","N","E.a","E.b","E.c","E.d","Chi^2.a","Chi^2.b","Chi^2.c","Chi^2.d","chi^2","Chi^2.Y.a","Chi^2.Y.b","Chi^2.Y.c","Chi^2.Y.d","Chi^2.Y","Chi.P","Chi.Y.P","Fis.P.one","Fis.P.two"]
["w1",5,5,5,5,{"$f":"B12+C12","v":10},{"$f":"D12+E12","v":10},{"$f":"B12+D12","v":10},{"$f":"C12+E12","v":10},{"$f":"SUM(B12:E12)","v":20},{"$f":"F12*H12/J12","v":5},{"$f":"F12*I12/J12","v":5},{"$f":"G12*H12/J12","v":5},{"$f":"G12*I12/J12","v":5},{"$f":"(B12-K12)^2/K12","v":0},0,0,0,{"$f":"SUM(O12:R12)","v":0},{"$f":"(ABS(B12-K12)-0.5)^2/K12","v":0.05},0.05,0.05,0.05,{"$f":"SUM(T12:W12)","v":0.2},{"$f":"Chi(B12,C12,D12,E12,1)","v":1},{"$f":"chiY(B12,C12,D12,E12,1)","v":0.65472084601857705},{"$f":"Fishert(B12,C12,D12,E12,2)","v":0.67185910065167753},{"$f":"Fishert(B12,C12,D12,E12,3)","v":1.0000000000000102}]
["w2",6,5,5,5,11,10,{"$f":"B13+D13","v":11},10,21,5.7619047619047619,5.2380952380952381,5.2380952380952381,4.7619047619047619,9.8386462022825687E-3,1.0822510822510826E-2,1.0822510822510826E-2,1.1904761904761908E-2,4.3388429752066124E-2,1.1904761904761901E-2,1.309523809523809E-2,1.309523809523809E-2,1.4404761904761899E-2,5.2499999999999984E-2,{"$f":"Chi(B13,C13,D13,E13,1)","v":0.83499559421104597},{"$f":"chiY(B13,C13,D13,E13,1)","v":0.81876882152062391},{"$f":"Fishert(B13,C13,D13,E13,2)","v":0.59002143367469229},{"$f":"Fishert(B13,C13,D13,E13,3)","v":1.0000000000000135}]
["w3",7,5,5,5,12,10,12,10,22,6.5454545454545459,5.4545454545454541,5.4545454545454541,4.5454545454545459,3.1565656565656512E-2,3.7878787878787817E-2,3.7878787878787817E-2,4.5454545454545373E-2,0.15277777777777751,3.1565656565657121E-4,3.7878787878788551E-4,3.7878787878788551E-4,4.5454545454546251E-4,1.5277777777778047E-3,{"$f":"Chi(B14,C14,D14,E14,1)","v":0.69589482317077689},{"$f":"chiY(B14,C14,D14,E14,1)","v":0.96882118659753347},{"$f":"Fishert(B14,C14,D14,E14,2)","v":0.51500357227912086},{"$f":"Fishert(B14,C14,D14,E14,3)","v":1.0000000000000127}]
["w4",8,5,5,5,13,10,13,10,23,7.3478260869565215,5.6521739130434785,5.6521739130434785,4.3478260869565215,5.7885258554154918E-2,7.5250836120401385E-2,7.5250836120401385E-2,9.7826086956521813E-2,0.30621301775147947,3.1515307435039976E-3,4.0969899665551967E-3,4.0969899665551967E-3,5.3260869565217557E-3,1.6671597633136147E-2,{"$f":"Chi(B15,C15,D15,E15,1)","v":0.58001337990908119},{"$f":"chiY(B15,C15,D15,E15,1)","v":0.89726385120785446},{"$f":"Fishert(B15,C15,D15,E15,2)","v":0.44790685152779491},{"$f":"Fishert(B15,C15,D15,E15,3)","v":0.68501817202853477}]
["w5",9,5,5,5,14,10,14,10,24,8.1666666666666661,5.833333333333333,5.833333333333333,4.166666666666667,8.5034013605442299E-2,0.11904761904761897,0.11904761904761897,0.16666666666666655,0.48979591836734682,1.3605442176870798E-2,1.9047619047619015E-2,1.9047619047619015E-2,2.6666666666666616E-2,7.8367346938775451E-2,{"$f":"Chi(B16,C16,D16,E16,1)","v":0.48401835470478172},{"$f":"chiY(B16,C16,D16,E16,1)","v":0.7795222453402717},{"$f":"Fishert(B16,C16,D16,E16,2)","v":0.38884775878314765},{"$f":"Fishert(B16,C16,D16,E16,3)","v":0.67845605061246561}]
["w6",10,5,5,5,15,10,15,10,25,9,6,6,4,0.1111111111111111,0.16666666666666666,0.16666666666666666,0.25,0.69444444444444442,2.7777777777777776E-2,4.1666666666666664E-2,4.1666666666666664E-2,6.25E-2,0.1736111111111111,{"$f":"Chi(B17,C17,D17,E17,1)","v":0.40465676192728606},{"$f":"chiY(B17,C17,D17,E17,1)","v":0.67692223902137927},{"$f":"Fishert(B17,C17,D17,E17,2)","v":0.33740072688114259},{"$f":"Fishert(B17,C17,D17,E17,3)","v":0.44221967963386866}]